| Duration | 2.833 sec |
|---|---|
| Tests | 5 |
| Failures | 0 |
| Duration | 14.444 sec |
|---|---|
| Tests | 15 |
| Failures | 0 |
| Test case: | [prun] mpich with an unknown resource manager exits non-zero |
|---|---|
| Outcome: | Passed |
| Duration: | 0.643 sec |
| Test case: | [prun] openmpi with an unknown resource manager exits non-zero |
|---|---|
| Outcome: | Passed |
| Duration: | 0.652 sec |
| Test case: | [prun] mvapich2 with an unknown resource manager exits non-zero |
|---|---|
| Outcome: | Passed |
| Duration: | 0.638 sec |
| Test case: | [prun] impi with an unknown resource manager exits non-zero |
|---|---|
| Outcome: | Passed |
| Duration: | 0.634 sec |
| Test case: | [prun] slurm launchers preserve executable paths and application arguments |
|---|---|
| Outcome: | Passed |
| Duration: | 1.792 sec |
| Test case: | [prun] openpbs launchers preserve executable paths and application arguments |
|---|---|
| Outcome: | Passed |
| Duration: | 1.284 sec |
| Test case: | [prun] flux launchers preserve executable paths and application arguments |
|---|---|
| Outcome: | Passed |
| Duration: | 1.29 sec |
| Test case: | [prun] starts an executable whose filename contains spaces |
|---|---|
| Outcome: | Passed |
| Duration: | 0.694 sec |
| Test case: | [prun] starts the checked executable rather than a glob match |
|---|---|
| Outcome: | Passed |
| Duration: | 0.727 sec |
| Test case: | [prun] openpbs keeps OpenMPI prefix and node file paths literal |
|---|---|
| Outcome: | Passed |
| Duration: | 1.007 sec |
| Duration | 14.904 sec |
|---|---|
| Tests | 3 |
| Failures | 0 |
| Duration | 13.851 sec |
|---|---|
| Tests | 3 |
| Failures | 0 |
| Duration | 13.848 sec |
|---|---|
| Tests | 3 |
| Failures | 0 |
| Duration | 12.791 sec |
|---|---|
| Tests | 3 |
| Failures | 0 |
| Duration | 15.959 sec |
|---|---|
| Tests | 3 |
| Failures | 0 |
| Duration | 20.168 sec |
|---|---|
| Tests | 3 |
| Failures | 0 |
| Duration | 4.37 sec |
|---|---|
| Tests | 4 |
| Failures | 0 |
| Duration | 0.768 sec |
|---|---|
| Tests | 6 |
| Failures | 1 |
| Test case: | [Compilers] C binary runs under resource manager (slurm/gnu16) |
|---|---|
| Outcome: | Passed |
| Duration: | 0.137 sec |
| Test case: | [Compilers] C++ binary runs under resource manager (slurm/gnu16) |
|---|---|
| Outcome: | Passed |
| Duration: | 0.135 sec |
| Test case: | [Compilers] Fortran binary runs under resource manager (slurm/gnu16) |
|---|---|
| Outcome: | Failed |
| Duration: | 0.118 sec |
| Failed |
(from function `run_serial_binary' in file ./common/functions, line 287,
in test file rm_execution, line 40)
`run_serial_binary -t "${TIMEOUT}" ./F90_test' failed with status 239
srun: job 25 queued and waiting for resources
srun: job 25 has been allocated resources
srun: error: Task launch for StepId=25.0 failed on node c1: Protocol authentication error
srun: error: Application launch failed: Protocol authentication error
srun: Job step aborted
| Test case: | [Compilers] C openmp binary runs under resource manager (slurm/gnu16) |
|---|---|
| Outcome: | Passed |
| Duration: | 0.14 sec |
| Duration | 0.271 sec |
|---|---|
| Tests | 7 |
| Failures | 0 |
| Test case: | [HWLOC] Verify HWLOC module is loaded and matches rpm version (gnu16/) |
|---|---|
| Outcome: | Passed |
| Duration: | 0.211 sec |
| Test case: | [HWLOC] Verify module HWLOC_DIR is defined and exists (gnu16/) |
|---|---|
| Outcome: | Passed |
| Duration: | 0.012 sec |
| Test case: | [HWLOC] Verify module HWLOC_LIB is defined and exists (gnu16/) |
|---|---|
| Outcome: | Passed |
| Duration: | 0.01 sec |
| Test case: | [HWLOC] Verify dynamic library available in HWLOC_LIB (gnu16/) |
|---|---|
| Outcome: | Passed |
| Duration: | 0.009 sec |
| Test case: | [HWLOC] Verify static library is not present in HWLOC_LIB (gnu16/) |
|---|---|
| Outcome: | Passed |
| Duration: | 0.01 sec |
| Duration | 0.028 sec |
|---|---|
| Tests | 3 |
| Failures | 0 |
| Duration | 0.025 sec |
|---|---|
| Tests | 3 |
| Failures | 0 |
| Duration | 0.029 sec |
|---|---|
| Tests | 3 |
| Failures | 0 |
| Duration | 0.275 sec |
|---|---|
| Tests | 4 |
| Failures | 0 |
| Test case: | [dev-tools/py3-numpy] Verify py3-numpy module is loaded and matches rpm version (gnu16) |
|---|---|
| Outcome: | Passed |
| Duration: | 0.217 sec |
| Test case: | [dev-tools/py3-numpy] Verify NUMPY_DIR is defined and directory exists (gnu16) |
|---|---|
| Outcome: | Passed |
| Duration: | 0.02 sec |
| Duration | 1.486 sec |
|---|---|
| Tests | 8 |
| Failures | 0 |
| Test case: | [dev-tools/Valgrind] Verify valgrind module is loaded and matches rpm version (gnu16) |
|---|---|
| Outcome: | Passed |
| Duration: | 0.199 sec |
| Test case: | [dev-tools/Valgrind] Verify VALGRIND_DIR is defined and directory exists (gnu16) |
|---|---|
| Outcome: | Passed |
| Duration: | 0.019 sec |
| Test case: | [dev-tools/Valgrind] Verify availability of valgrind binary (gnu16) |
|---|---|
| Outcome: | Passed |
| Duration: | 0.03 sec |
| Test case: | [dev-tools/Valgrind] Verify availability of man page (gnu16) |
|---|---|
| Outcome: | Passed |
| Duration: | 0.057 sec |
| Test case: | [dev-tools/Valgrind] Verify module VALGRIND_INC is defined and exists (gnu16) |
|---|---|
| Outcome: | Passed |
| Duration: | 0.02 sec |
| Duration | 12.718 sec |
|---|---|
| Tests | 7 |
| Failures | 0 |
| Duration | 0.359 sec |
|---|---|
| Tests | 7 |
| Failures | 0 |
| Test case: | [libs/adios2] Verify ADIOS2 module is loaded and matches rpm version (gnu16/mpich) |
|---|---|
| Outcome: | Passed |
| Duration: | 0.228 sec |
| Test case: | [libs/adios2] Verify module ADIOS2_DIR is defined and exists (gnu16/mpich) |
|---|---|
| Outcome: | Passed |
| Duration: | 0.02 sec |
| Test case: | [libs/adios2] Verify module ADIOS2_BIN is defined and exists (gnu16/mpich) |
|---|---|
| Outcome: | Passed |
| Duration: | 0.022 sec |
| Test case: | [libs/adios2] Verify module ADIOS2_LIB is defined and exists (gnu16/mpich) |
|---|---|
| Outcome: | Passed |
| Duration: | 0.021 sec |
| Test case: | [libs/adios2] Verify dynamic library available in ADIOS2_LIB (gnu16/mpich) |
|---|---|
| Outcome: | Passed |
| Duration: | 0.026 sec |
| Duration | 0.374 sec |
|---|---|
| Tests | 7 |
| Failures | 0 |
| Test case: | [libs/adios2] Verify ADIOS2 module is loaded and matches rpm version (gnu16/openmpi5) |
|---|---|
| Outcome: | Passed |
| Duration: | 0.244 sec |
| Test case: | [libs/adios2] Verify module ADIOS2_DIR is defined and exists (gnu16/openmpi5) |
|---|---|
| Outcome: | Passed |
| Duration: | 0.021 sec |
| Test case: | [libs/adios2] Verify module ADIOS2_BIN is defined and exists (gnu16/openmpi5) |
|---|---|
| Outcome: | Passed |
| Duration: | 0.018 sec |
| Test case: | [libs/adios2] Verify module ADIOS2_LIB is defined and exists (gnu16/openmpi5) |
|---|---|
| Outcome: | Passed |
| Duration: | 0.021 sec |
| Test case: | [libs/adios2] Verify dynamic library available in ADIOS2_LIB (gnu16/openmpi5) |
|---|---|
| Outcome: | Passed |
| Duration: | 0.027 sec |
| Duration | 0.369 sec |
|---|---|
| Tests | 7 |
| Failures | 0 |
| Test case: | [libs/adios2] Verify ADIOS2 module is loaded and matches rpm version (gnu16/mvapich2) |
|---|---|
| Outcome: | Passed |
| Duration: | 0.241 sec |
| Test case: | [libs/adios2] Verify module ADIOS2_DIR is defined and exists (gnu16/mvapich2) |
|---|---|
| Outcome: | Passed |
| Duration: | 0.02 sec |
| Test case: | [libs/adios2] Verify module ADIOS2_BIN is defined and exists (gnu16/mvapich2) |
|---|---|
| Outcome: | Passed |
| Duration: | 0.021 sec |
| Test case: | [libs/adios2] Verify module ADIOS2_LIB is defined and exists (gnu16/mvapich2) |
|---|---|
| Outcome: | Passed |
| Duration: | 0.021 sec |
| Test case: | [libs/adios2] Verify dynamic library available in ADIOS2_LIB (gnu16/mvapich2) |
|---|---|
| Outcome: | Passed |
| Duration: | 0.025 sec |
| Duration | 0.556 sec |
|---|---|
| Tests | 4 |
| Failures | 0 |
| Test case: | [Boost/Accumulators] min-test under resource manager (slurm/gnu16/mpich) |
|---|---|
| Outcome: | Passed |
| Duration: | 0.161 sec |
| Test case: | [Boost/Accumulators] max-test under resource manager (slurm/gnu16/mpich) |
|---|---|
| Outcome: | Passed |
| Duration: | 0.124 sec |
| Duration | 0.563 sec |
|---|---|
| Tests | 4 |
| Failures | 0 |
| Test case: | [Boost/Accumulators] min-test under resource manager (slurm/gnu16/mvapich2) |
|---|---|
| Outcome: | Passed |
| Duration: | 0.128 sec |
| Test case: | [Boost/Accumulators] max-test under resource manager (slurm/gnu16/mvapich2) |
|---|---|
| Outcome: | Passed |
| Duration: | 0.132 sec |
| Duration | 0.584 sec |
|---|---|
| Tests | 4 |
| Failures | 0 |
| Test case: | [Boost/Accumulators] min-test under resource manager (slurm/gnu16/openmpi5) |
|---|---|
| Outcome: | Passed |
| Duration: | 0.175 sec |
| Test case: | [Boost/Accumulators] max-test under resource manager (slurm/gnu16/openmpi5) |
|---|---|
| Outcome: | Passed |
| Duration: | 0.146 sec |
| Duration | 2.743 sec |
|---|---|
| Tests | 8 |
| Failures | 0 |
| Test case: | [BOOST] Verify BOOST module is loaded and matches rpm version (gnu16/mpich) |
|---|---|
| Outcome: | Passed |
| Duration: | 0.225 sec |
| Test case: | [BOOST] Verify module BOOST_DIR is defined and exists (gnu16/mpich) |
|---|---|
| Outcome: | Passed |
| Duration: | 0.014 sec |
| Test case: | [BOOST] Verify module BOOST_LIB is defined and exists (gnu16/mpich) |
|---|---|
| Outcome: | Passed |
| Duration: | 0.007 sec |
| Test case: | [BOOST] Verify dynamic library available in BOOST_LIB (gnu16/mpich) |
|---|---|
| Outcome: | Passed |
| Duration: | 0.009 sec |
| Test case: | [BOOST] Verify static library is not present in BOOST_LIB (gnu16/mpich) |
|---|---|
| Outcome: | Passed |
| Duration: | 0.009 sec |
| Test case: | [BOOST] Verify module BOOST_INC is defined and exists (gnu16/mpich) |
|---|---|
| Outcome: | Passed |
| Duration: | 0.009 sec |
| Duration | 2.953 sec |
|---|---|
| Tests | 8 |
| Failures | 0 |
| Test case: | [BOOST] Verify BOOST module is loaded and matches rpm version (gnu16/mvapich2) |
|---|---|
| Outcome: | Passed |
| Duration: | 0.234 sec |
| Test case: | [BOOST] Verify module BOOST_DIR is defined and exists (gnu16/mvapich2) |
|---|---|
| Outcome: | Passed |
| Duration: | 0.011 sec |
| Test case: | [BOOST] Verify module BOOST_LIB is defined and exists (gnu16/mvapich2) |
|---|---|
| Outcome: | Passed |
| Duration: | 0.008 sec |
| Test case: | [BOOST] Verify dynamic library available in BOOST_LIB (gnu16/mvapich2) |
|---|---|
| Outcome: | Passed |
| Duration: | 0.008 sec |
| Test case: | [BOOST] Verify static library is not present in BOOST_LIB (gnu16/mvapich2) |
|---|---|
| Outcome: | Passed |
| Duration: | 0.008 sec |
| Test case: | [BOOST] Verify module BOOST_INC is defined and exists (gnu16/mvapich2) |
|---|---|
| Outcome: | Passed |
| Duration: | 0.009 sec |
| Duration | 2.887 sec |
|---|---|
| Tests | 8 |
| Failures | 0 |
| Test case: | [BOOST] Verify BOOST module is loaded and matches rpm version (gnu16/openmpi5) |
|---|---|
| Outcome: | Passed |
| Duration: | 0.238 sec |
| Test case: | [BOOST] Verify module BOOST_DIR is defined and exists (gnu16/openmpi5) |
|---|---|
| Outcome: | Passed |
| Duration: | 0.01 sec |
| Test case: | [BOOST] Verify module BOOST_LIB is defined and exists (gnu16/openmpi5) |
|---|---|
| Outcome: | Passed |
| Duration: | 0.01 sec |
| Test case: | [BOOST] Verify dynamic library available in BOOST_LIB (gnu16/openmpi5) |
|---|---|
| Outcome: | Passed |
| Duration: | 0.009 sec |
| Test case: | [BOOST] Verify static library is not present in BOOST_LIB (gnu16/openmpi5) |
|---|---|
| Outcome: | Passed |
| Duration: | 0.01 sec |
| Test case: | [BOOST] Verify module BOOST_INC is defined and exists (gnu16/openmpi5) |
|---|---|
| Outcome: | Passed |
| Duration: | 0.009 sec |
| Duration | 0.503 sec |
|---|---|
| Tests | 4 |
| Failures | 0 |
| Test case: | [Boost/Multi Array] access-test under resource manager (slurm/gnu16/mpich) |
|---|---|
| Outcome: | Passed |
| Duration: | 0.137 sec |
| Test case: | [Boost/Multi Array] iterators-test under resource manager (slurm/gnu16/mpich) |
|---|---|
| Outcome: | Passed |
| Duration: | 0.12 sec |
| Duration | 0.565 sec |
|---|---|
| Tests | 4 |
| Failures | 0 |
| Test case: | [Boost/Multi Array] access-test under resource manager (slurm/gnu16/mvapich2) |
|---|---|
| Outcome: | Passed |
| Duration: | 0.125 sec |
| Test case: | [Boost/Multi Array] iterators-test under resource manager (slurm/gnu16/mvapich2) |
|---|---|
| Outcome: | Passed |
| Duration: | 0.157 sec |
| Duration | 0.561 sec |
|---|---|
| Tests | 4 |
| Failures | 0 |
| Test case: | [Boost/Multi Array] access-test under resource manager (slurm/gnu16/openmpi5) |
|---|---|
| Outcome: | Passed |
| Duration: | 0.156 sec |
| Test case: | [Boost/Multi Array] iterators-test under resource manager (slurm/gnu16/openmpi5) |
|---|---|
| Outcome: | Passed |
| Duration: | 0.125 sec |
| Duration | 1.249 sec |
|---|---|
| Tests | 11 |
| Failures | 0 |
| Test case: | [Boost/Program Options] cmdline_test under resource manager (slurm/gnu16/openmpi5) |
|---|---|
| Outcome: | Passed |
| Duration: | 0.173 sec |
| Test case: | [Boost/Program Options] exception_test under resource manager (slurm/gnu16/openmpi5) |
|---|---|
| Outcome: | Passed |
| Duration: | 0.127 sec |
| Test case: | [Boost/Program Options] options_description_test under resource manager (slurm/gnu16/openmpi5) |
|---|---|
| Outcome: | Passed |
| Duration: | 0.128 sec |
| Test case: | [Boost/Program Options] parsers_test on master host(gnu16/openmpi5) |
|---|---|
| Outcome: | Passed |
| Duration: | 0.015 sec |
| Test case: | [Boost/Program Options] parsers_test under resource manager (slurm/gnu16/openmpi5) |
|---|---|
| Outcome: | Passed |
| Duration: | 0.131 sec |
| Test case: | [Boost/Program Options] positional_options_test under resource manager (slurm/gnu16/openmpi5) |
|---|---|
| Outcome: | Passed |
| Duration: | 0.131 sec |
| Test case: | [Boost/Program Options] required_test on master host(gnu16/openmpi5) |
|---|---|
| Outcome: | Passed |
| Duration: | 0.015 sec |
| Test case: | [Boost/Program Options] required_test under resource manager (slurm/gnu16/openmpi5) |
|---|---|
| Outcome: | Passed |
| Duration: | 0.134 sec |
| Test case: | [Boost/Program Options] unicode_test under resource manager (slurm/gnu16/openmpi5) |
|---|---|
| Outcome: | Passed |
| Duration: | 0.133 sec |
| Duration | 1.233 sec |
|---|---|
| Tests | 11 |
| Failures | 0 |
| Test case: | [Boost/Program Options] cmdline_test under resource manager (slurm/gnu16/mpich) |
|---|---|
| Outcome: | Passed |
| Duration: | 0.126 sec |
| Test case: | [Boost/Program Options] exception_test under resource manager (slurm/gnu16/mpich) |
|---|---|
| Outcome: | Passed |
| Duration: | 0.127 sec |
| Test case: | [Boost/Program Options] options_description_test under resource manager (slurm/gnu16/mpich) |
|---|---|
| Outcome: | Passed |
| Duration: | 0.128 sec |
| Test case: | [Boost/Program Options] parsers_test on master host(gnu16/mpich) |
|---|---|
| Outcome: | Passed |
| Duration: | 0.014 sec |
| Test case: | [Boost/Program Options] parsers_test under resource manager (slurm/gnu16/mpich) |
|---|---|
| Outcome: | Passed |
| Duration: | 0.123 sec |
| Test case: | [Boost/Program Options] positional_options_test under resource manager (slurm/gnu16/mpich) |
|---|---|
| Outcome: | Passed |
| Duration: | 0.151 sec |
| Test case: | [Boost/Program Options] required_test on master host(gnu16/mpich) |
|---|---|
| Outcome: | Passed |
| Duration: | 0.015 sec |
| Test case: | [Boost/Program Options] required_test under resource manager (slurm/gnu16/mpich) |
|---|---|
| Outcome: | Passed |
| Duration: | 0.167 sec |
| Test case: | [Boost/Program Options] unicode_test under resource manager (slurm/gnu16/mpich) |
|---|---|
| Outcome: | Passed |
| Duration: | 0.127 sec |
| Duration | 1.229 sec |
|---|---|
| Tests | 11 |
| Failures | 0 |
| Test case: | [Boost/Program Options] cmdline_test under resource manager (slurm/gnu16/mvapich2) |
|---|---|
| Outcome: | Passed |
| Duration: | 0.121 sec |
| Test case: | [Boost/Program Options] exception_test under resource manager (slurm/gnu16/mvapich2) |
|---|---|
| Outcome: | Passed |
| Duration: | 0.133 sec |
| Test case: | [Boost/Program Options] options_description_test under resource manager (slurm/gnu16/mvapich2) |
|---|---|
| Outcome: | Passed |
| Duration: | 0.161 sec |
| Test case: | [Boost/Program Options] parsers_test on master host(gnu16/mvapich2) |
|---|---|
| Outcome: | Passed |
| Duration: | 0.015 sec |
| Test case: | [Boost/Program Options] parsers_test under resource manager (slurm/gnu16/mvapich2) |
|---|---|
| Outcome: | Passed |
| Duration: | 0.151 sec |
| Test case: | [Boost/Program Options] positional_options_test under resource manager (slurm/gnu16/mvapich2) |
|---|---|
| Outcome: | Passed |
| Duration: | 0.122 sec |
| Test case: | [Boost/Program Options] required_test on master host(gnu16/mvapich2) |
|---|---|
| Outcome: | Passed |
| Duration: | 0.013 sec |
| Test case: | [Boost/Program Options] required_test under resource manager (slurm/gnu16/mvapich2) |
|---|---|
| Outcome: | Passed |
| Duration: | 0.119 sec |
| Test case: | [Boost/Program Options] unicode_test under resource manager (slurm/gnu16/mvapich2) |
|---|---|
| Outcome: | Passed |
| Duration: | 0.14 sec |
| Duration | 1.81 sec |
|---|---|
| Tests | 4 |
| Failures | 0 |
| Test case: | [Boost/Random] test_piecewise_linear under resource manager (slurm/gnu16/openmpi5) |
|---|---|
| Outcome: | Passed |
| Duration: | 1.148 sec |
| Test case: | [Boost/Random] test_discrete under resource manager (slurm/gnu16/openmpi5) |
|---|---|
| Outcome: | Passed |
| Duration: | 0.393 sec |
| Duration | 1.758 sec |
|---|---|
| Tests | 4 |
| Failures | 0 |
| Test case: | [Boost/Random] test_piecewise_linear under resource manager (slurm/gnu16/mpich) |
|---|---|
| Outcome: | Passed |
| Duration: | 1.102 sec |
| Test case: | [Boost/Random] test_discrete under resource manager (slurm/gnu16/mpich) |
|---|---|
| Outcome: | Passed |
| Duration: | 0.375 sec |
| Duration | 1.782 sec |
|---|---|
| Tests | 4 |
| Failures | 0 |
| Test case: | [Boost/Random] test_piecewise_linear under resource manager (slurm/gnu16/mvapich2) |
|---|---|
| Outcome: | Passed |
| Duration: | 1.125 sec |
| Test case: | [Boost/Random] test_discrete under resource manager (slurm/gnu16/mvapich2) |
|---|---|
| Outcome: | Passed |
| Duration: | 0.376 sec |
| Duration | 0.81 sec |
|---|---|
| Tests | 3 |
| Failures | 0 |
| Duration | 0.869 sec |
|---|---|
| Tests | 3 |
| Failures | 0 |
| Duration | 0.829 sec |
|---|---|
| Tests | 3 |
| Failures | 0 |
| Duration | 0.286 sec |
|---|---|
| Tests | 7 |
| Failures | 0 |
| Test case: | [BOOST] Verify BOOST module is loaded and matches rpm version (gnu16/mpich) |
|---|---|
| Outcome: | Passed |
| Duration: | 0.23 sec |
| Test case: | [BOOST] Verify module BOOST_DIR is defined and exists (gnu16/mpich) |
|---|---|
| Outcome: | Passed |
| Duration: | 0.012 sec |
| Test case: | [BOOST] Verify module BOOST_LIB is defined and exists (gnu16/mpich) |
|---|---|
| Outcome: | Passed |
| Duration: | 0.009 sec |
| Test case: | [BOOST] Verify dynamic library available in BOOST_LIB (gnu16/mpich) |
|---|---|
| Outcome: | Passed |
| Duration: | 0.008 sec |
| Test case: | [BOOST] Verify static library is not present in BOOST_LIB (gnu16/mpich) |
|---|---|
| Outcome: | Passed |
| Duration: | 0.009 sec |
| Duration | 0.301 sec |
|---|---|
| Tests | 7 |
| Failures | 0 |
| Test case: | [BOOST] Verify BOOST module is loaded and matches rpm version (gnu16/mvapich2) |
|---|---|
| Outcome: | Passed |
| Duration: | 0.246 sec |
| Test case: | [BOOST] Verify module BOOST_DIR is defined and exists (gnu16/mvapich2) |
|---|---|
| Outcome: | Passed |
| Duration: | 0.01 sec |
| Test case: | [BOOST] Verify module BOOST_LIB is defined and exists (gnu16/mvapich2) |
|---|---|
| Outcome: | Passed |
| Duration: | 0.01 sec |
| Test case: | [BOOST] Verify dynamic library available in BOOST_LIB (gnu16/mvapich2) |
|---|---|
| Outcome: | Passed |
| Duration: | 0.009 sec |
| Test case: | [BOOST] Verify static library is not present in BOOST_LIB (gnu16/mvapich2) |
|---|---|
| Outcome: | Passed |
| Duration: | 0.009 sec |
| Duration | 0.286 sec |
|---|---|
| Tests | 7 |
| Failures | 0 |
| Test case: | [BOOST] Verify BOOST module is loaded and matches rpm version (gnu16/openmpi5) |
|---|---|
| Outcome: | Passed |
| Duration: | 0.234 sec |
| Test case: | [BOOST] Verify module BOOST_DIR is defined and exists (gnu16/openmpi5) |
|---|---|
| Outcome: | Passed |
| Duration: | 0.011 sec |
| Test case: | [BOOST] Verify module BOOST_LIB is defined and exists (gnu16/openmpi5) |
|---|---|
| Outcome: | Passed |
| Duration: | 0.008 sec |
| Test case: | [BOOST] Verify dynamic library available in BOOST_LIB (gnu16/openmpi5) |
|---|---|
| Outcome: | Passed |
| Duration: | 0.008 sec |
| Test case: | [BOOST] Verify static library is not present in BOOST_LIB (gnu16/openmpi5) |
|---|---|
| Outcome: | Passed |
| Duration: | 0.009 sec |
| Duration | 112.456 sec |
|---|---|
| Tests | 7 |
| Failures | 0 |
| Test case: | [Boost/MPI] all_gather_test under resource manager (slurm/gnu16/openmpi5) |
|---|---|
| Outcome: | Passed |
| Duration: | 9.597 sec |
| Test case: | [Boost/MPI] all_reduce_test under resource manager (slurm/gnu16/openmpi5) |
|---|---|
| Outcome: | Passed |
| Duration: | 11.702 sec |
| Test case: | [Boost/MPI] all_to_all_test under resource manager (slurm/gnu16/openmpi5) |
|---|---|
| Outcome: | Passed |
| Duration: | 13.808 sec |
| Test case: | [Boost/MPI] groups_test under resource manager (slurm/gnu16/openmpi5) |
|---|---|
| Outcome: | Passed |
| Duration: | 15.912 sec |
| Test case: | [Boost/MPI] broadcast_test under resource manager (slurm/gnu16/openmpi5) |
|---|---|
| Outcome: | Passed |
| Duration: | 18.018 sec |
| Duration | 58.705 sec |
|---|---|
| Tests | 7 |
| Failures | 0 |
| Test case: | [Boost/MPI] all_gather_test under resource manager (slurm/gnu16/mvapich2) |
|---|---|
| Outcome: | Passed |
| Duration: | 7.485 sec |
| Test case: | [Boost/MPI] all_reduce_test under resource manager (slurm/gnu16/mvapich2) |
|---|---|
| Outcome: | Passed |
| Duration: | 7.485 sec |
| Test case: | [Boost/MPI] all_to_all_test under resource manager (slurm/gnu16/mvapich2) |
|---|---|
| Outcome: | Passed |
| Duration: | 7.486 sec |
| Test case: | [Boost/MPI] groups_test under resource manager (slurm/gnu16/mvapich2) |
|---|---|
| Outcome: | Passed |
| Duration: | 8.535 sec |
| Test case: | [Boost/MPI] broadcast_test under resource manager (slurm/gnu16/mvapich2) |
|---|---|
| Outcome: | Passed |
| Duration: | 8.527 sec |
| Duration | 22.863 sec |
|---|---|
| Tests | 7 |
| Failures | 0 |
| Test case: | [Boost/MPI] all_gather_test under resource manager (slurm/gnu16/mpich) |
|---|---|
| Outcome: | Passed |
| Duration: | 2.212 sec |
| Test case: | [Boost/MPI] all_reduce_test under resource manager (slurm/gnu16/mpich) |
|---|---|
| Outcome: | Passed |
| Duration: | 2.214 sec |
| Test case: | [Boost/MPI] all_to_all_test under resource manager (slurm/gnu16/mpich) |
|---|---|
| Outcome: | Passed |
| Duration: | 3.259 sec |
| Test case: | [Boost/MPI] groups_test under resource manager (slurm/gnu16/mpich) |
|---|---|
| Outcome: | Passed |
| Duration: | 3.269 sec |
| Test case: | [Boost/MPI] broadcast_test under resource manager (slurm/gnu16/mpich) |
|---|---|
| Outcome: | Passed |
| Duration: | 3.265 sec |
| Duration | 0.25 sec |
|---|---|
| Tests | 7 |
| Failures | 0 |
| Test case: | [FFTW] Verify FFTW module is loaded and matches rpm version (gnu16/mpich) |
|---|---|
| Outcome: | Passed |
| Duration: | 0.191 sec |
| Test case: | [FFTW] Verify module FFTW_DIR is defined and exists (gnu16/mpich) |
|---|---|
| Outcome: | Passed |
| Duration: | 0.011 sec |
| Test case: | [FFTW] Verify module FFTW_LIB is defined and exists (gnu16/mpich) |
|---|---|
| Outcome: | Passed |
| Duration: | 0.01 sec |
| Test case: | [FFTW] Verify dynamic library available in FFTW_LIB (gnu16/mpich) |
|---|---|
| Outcome: | Passed |
| Duration: | 0.01 sec |
| Test case: | [FFTW] Verify static library is not present in FFTW_LIB (gnu16/mpich) |
|---|---|
| Outcome: | Passed |
| Duration: | 0.01 sec |
| Duration | 0.252 sec |
|---|---|
| Tests | 7 |
| Failures | 0 |
| Test case: | [FFTW] Verify FFTW module is loaded and matches rpm version (gnu16/mvapich2) |
|---|---|
| Outcome: | Passed |
| Duration: | 0.191 sec |
| Test case: | [FFTW] Verify module FFTW_DIR is defined and exists (gnu16/mvapich2) |
|---|---|
| Outcome: | Passed |
| Duration: | 0.012 sec |
| Test case: | [FFTW] Verify module FFTW_LIB is defined and exists (gnu16/mvapich2) |
|---|---|
| Outcome: | Passed |
| Duration: | 0.01 sec |
| Test case: | [FFTW] Verify dynamic library available in FFTW_LIB (gnu16/mvapich2) |
|---|---|
| Outcome: | Passed |
| Duration: | 0.01 sec |
| Test case: | [FFTW] Verify static library is not present in FFTW_LIB (gnu16/mvapich2) |
|---|---|
| Outcome: | Passed |
| Duration: | 0.01 sec |
| Duration | 0.259 sec |
|---|---|
| Tests | 7 |
| Failures | 0 |
| Test case: | [FFTW] Verify FFTW module is loaded and matches rpm version (gnu16/openmpi5) |
|---|---|
| Outcome: | Passed |
| Duration: | 0.201 sec |
| Test case: | [FFTW] Verify module FFTW_DIR is defined and exists (gnu16/openmpi5) |
|---|---|
| Outcome: | Passed |
| Duration: | 0.01 sec |
| Test case: | [FFTW] Verify module FFTW_LIB is defined and exists (gnu16/openmpi5) |
|---|---|
| Outcome: | Passed |
| Duration: | 0.01 sec |
| Test case: | [FFTW] Verify dynamic library available in FFTW_LIB (gnu16/openmpi5) |
|---|---|
| Outcome: | Passed |
| Duration: | 0.009 sec |
| Test case: | [FFTW] Verify static library is not present in FFTW_LIB (gnu16/openmpi5) |
|---|---|
| Outcome: | Passed |
| Duration: | 0.01 sec |
| Duration | 4.264 sec |
|---|---|
| Tests | 3 |
| Failures | 1 |
| Test case: | [libs/FFTW] Serial C binary runs under resource manager (slurm/gnu16/mpich) |
|---|---|
| Outcome: | Passed |
| Duration: | 0.152 sec |
| Test case: | [libs/FFTW] MPI C binary runs under resource manager (slurm/gnu16/mpich) |
|---|---|
| Outcome: | Passed |
| Duration: | 2.218 sec |
| Test case: | [libs/FFTW] Serial Fortran binary runs under resource manager (slurm/gnu16/mpich) |
|---|---|
| Outcome: | Failed |
| Duration: | 1.894 sec |
| Failed |
(from function `run_serial_binary' in file ../../../common/functions, line 287,
in test file rm_execution, line 50)
`run_serial_binary -t "${TIMEOUT}" ./F_test' failed with status 239
srun: job 145 queued and waiting for resources
srun: job 145 has been allocated resources
srun: error: Task launch for StepId=145.0 failed on node c1: Protocol authentication error
srun: error: Application launch failed: Protocol authentication error
srun: Job step aborted
| Duration | 5.836 sec |
|---|---|
| Tests | 3 |
| Failures | 1 |
| Test case: | [libs/FFTW] Serial C binary runs under resource manager (slurm/gnu16/mvapich2) |
|---|---|
| Outcome: | Passed |
| Duration: | 0.13 sec |
| Test case: | [libs/FFTW] MPI C binary runs under resource manager (slurm/gnu16/mvapich2) |
|---|---|
| Outcome: | Passed |
| Duration: | 3.267 sec |
| Test case: | [libs/FFTW] Serial Fortran binary runs under resource manager (slurm/gnu16/mvapich2) |
|---|---|
| Outcome: | Failed |
| Duration: | 2.439 sec |
| Failed |
(from function `run_serial_binary' in file ../../../common/functions, line 287,
in test file rm_execution, line 50)
`run_serial_binary -t "${TIMEOUT}" ./F_test' failed with status 239
srun: job 148 queued and waiting for resources
srun: job 148 has been allocated resources
srun: error: Task launch for StepId=148.0 failed on node c1: Protocol authentication error
srun: error: Application launch failed: Protocol authentication error
srun: Job step aborted
| Duration | 19.665 sec |
|---|---|
| Tests | 3 |
| Failures | 1 |
| Test case: | [libs/FFTW] Serial C binary runs under resource manager (slurm/gnu16/openmpi5) |
|---|---|
| Outcome: | Passed |
| Duration: | 0.578 sec |
| Test case: | [libs/FFTW] MPI C binary runs under resource manager (slurm/gnu16/openmpi5) |
|---|---|
| Outcome: | Passed |
| Duration: | 9.595 sec |
| Test case: | [libs/FFTW] Serial Fortran binary runs under resource manager (slurm/gnu16/openmpi5) |
|---|---|
| Outcome: | Failed |
| Duration: | 9.492 sec |
| Failed |
(from function `run_serial_binary' in file ../../../common/functions, line 287,
in test file rm_execution, line 50)
`run_serial_binary -t "${TIMEOUT}" ./F_test' failed with status 239
srun: job 151 queued and waiting for resources
srun: job 151 has been allocated resources
srun: error: Task launch for StepId=151.0 failed on node c1: Protocol authentication error
srun: error: Application launch failed: Protocol authentication error
srun: Job step aborted
| Duration | 35.216 sec |
|---|---|
| Tests | 50 |
| Failures | 0 |
| Test case: | [libs/GSL] run block under resource manager (slurm/gnu16) |
|---|---|
| Outcome: | Passed |
| Duration: | 0.173 sec |
| Test case: | [libs/GSL] run bspline under resource manager (slurm/gnu16) |
|---|---|
| Outcome: | Passed |
| Duration: | 0.573 sec |
| Test case: | [libs/GSL] run cblas under resource manager (slurm/gnu16) |
|---|---|
| Outcome: | Passed |
| Duration: | 0.14 sec |
| Test case: | [libs/GSL] run cheb under resource manager (slurm/gnu16) |
|---|---|
| Outcome: | Passed |
| Duration: | 0.122 sec |
| Test case: | [libs/GSL] run combination under resource manager (slurm/gnu16) |
|---|---|
| Outcome: | Passed |
| Duration: | 0.144 sec |
| Test case: | [libs/GSL] run complex under resource manager (slurm/gnu16) |
|---|---|
| Outcome: | Passed |
| Duration: | 0.143 sec |
| Test case: | [libs/GSL] run const under resource manager (slurm/gnu16) |
|---|---|
| Outcome: | Passed |
| Duration: | 0.156 sec |
| Test case: | [libs/GSL] run deriv under resource manager (slurm/gnu16) |
|---|---|
| Outcome: | Passed |
| Duration: | 0.126 sec |
| Test case: | [libs/GSL] run diff under resource manager (slurm/gnu16) |
|---|---|
| Outcome: | Passed |
| Duration: | 0.121 sec |
| Test case: | [libs/GSL] run eigen under resource manager (slurm/gnu16) |
|---|---|
| Outcome: | Passed |
| Duration: | 0.31 sec |
| Test case: | [libs/GSL] run histogram under resource manager (slurm/gnu16) |
|---|---|
| Outcome: | Passed |
| Duration: | 0.213 sec |
| Test case: | [libs/GSL] run ieee-utils under resource manager (slurm/gnu16) |
|---|---|
| Outcome: | Passed |
| Duration: | 0.122 sec |
| Test case: | [libs/GSL] run integration under resource manager (slurm/gnu16) |
|---|---|
| Outcome: | Passed |
| Duration: | 2.9 sec |
| Test case: | [libs/GSL] run interpolation under resource manager (slurm/gnu16) |
|---|---|
| Outcome: | Passed |
| Duration: | 0.122 sec |
| Test case: | [libs/GSL] run linalg under resource manager (slurm/gnu16) |
|---|---|
| Outcome: | Passed |
| Duration: | 1.415 sec |
| Test case: | [libs/GSL] run matrix under resource manager (slurm/gnu16) |
|---|---|
| Outcome: | Passed |
| Duration: | 0.645 sec |
| Test case: | [libs/GSL] run monte under resource manager (slurm/gnu16) |
|---|---|
| Outcome: | Passed |
| Duration: | 1.537 sec |
| Test case: | [libs/GSL] run multifit under resource manager (slurm/gnu16) |
|---|---|
| Outcome: | Passed |
| Duration: | 1.895 sec |
| Test case: | [libs/GSL] run multilarge under resource manager (slurm/gnu16) |
|---|---|
| Outcome: | Passed |
| Duration: | 0.158 sec |
| Test case: | [libs/GSL] run multimin under resource manager (slurm/gnu16) |
|---|---|
| Outcome: | Passed |
| Duration: | 0.122 sec |
| Test case: | [libs/GSL] run multiroots under resource manager (slurm/gnu16) |
|---|---|
| Outcome: | Passed |
| Duration: | 0.131 sec |
| Test case: | [libs/GSL] run multiset under resource manager (slurm/gnu16) |
|---|---|
| Outcome: | Passed |
| Duration: | 0.126 sec |
| Test case: | [libs/GSL] run ntuple under resource manager (slurm/gnu16) |
|---|---|
| Outcome: | Passed |
| Duration: | 0.128 sec |
| Test case: | [libs/GSL] run ode-initval under resource manager (slurm/gnu16) |
|---|---|
| Outcome: | Passed |
| Duration: | 0.474 sec |
| Test case: | [libs/GSL] run ode-initval2 under resource manager (slurm/gnu16) |
|---|---|
| Outcome: | Passed |
| Duration: | 5.833 sec |
| Test case: | [libs/GSL] run permutation under resource manager (slurm/gnu16) |
|---|---|
| Outcome: | Passed |
| Duration: | 0.137 sec |
| Test case: | [libs/GSL] run poly under resource manager (slurm/gnu16) |
|---|---|
| Outcome: | Passed |
| Duration: | 0.119 sec |
| Test case: | [libs/GSL] run qrng under resource manager (slurm/gnu16) |
|---|---|
| Outcome: | Passed |
| Duration: | 0.125 sec |
| Test case: | [libs/GSL] run randist under resource manager (slurm/gnu16) |
|---|---|
| Outcome: | Passed |
| Duration: | 1.263 sec |
| Test case: | [libs/GSL] run roots under resource manager (slurm/gnu16) |
|---|---|
| Outcome: | Passed |
| Duration: | 0.12 sec |
| Test case: | [libs/GSL] run rstat under resource manager (slurm/gnu16) |
|---|---|
| Outcome: | Passed |
| Duration: | 1.407 sec |
| Test case: | [libs/GSL] run sort under resource manager (slurm/gnu16) |
|---|---|
| Outcome: | Passed |
| Duration: | 0.201 sec |
| Test case: | [libs/GSL] run spblas under resource manager (slurm/gnu16) |
|---|---|
| Outcome: | Passed |
| Duration: | 0.359 sec |
| Test case: | [libs/GSL] run specfunc under resource manager (slurm/gnu16) |
|---|---|
| Outcome: | Passed |
| Duration: | 2.384 sec |
| Test case: | [libs/GSL] run splinalg under resource manager (slurm/gnu16) |
|---|---|
| Outcome: | Passed |
| Duration: | 0.404 sec |
| Test case: | [libs/GSL] run spmatrix under resource manager (slurm/gnu16) |
|---|---|
| Outcome: | Passed |
| Duration: | 0.194 sec |
| Test case: | [libs/GSL] run statistics under resource manager (slurm/gnu16) |
|---|---|
| Outcome: | Passed |
| Duration: | 0.128 sec |
| Duration | 0.24 sec |
|---|---|
| Tests | 7 |
| Failures | 0 |
| Test case: | [libs/GSL] Verify GSL module is loaded and matches rpm version (gnu16) |
|---|---|
| Outcome: | Passed |
| Duration: | 0.184 sec |
| Test case: | [libs/GSL] Verify module GSL_DIR is defined and exists (gnu16) |
|---|---|
| Outcome: | Passed |
| Duration: | 0.012 sec |
| Test case: | [libs/GSL] Verify module GSL_LIB is defined and exists (gnu16) |
|---|---|
| Outcome: | Passed |
| Duration: | 0.009 sec |
| Test case: | [libs/GSL] Verify dynamic library available in GSL_LIB (gnu16) |
|---|---|
| Outcome: | Passed |
| Duration: | 0.009 sec |
| Test case: | [libs/GSL] Verify static library is not present in GSL_LIB (gnu16) |
|---|---|
| Outcome: | Passed |
| Duration: | 0.008 sec |
| Duration | 29.47 sec |
|---|---|
| Tests | 12 |
| Failures | 0 |
| Test case: | [libs/HYPRE] 2 PE structured test binary runs under resource manager (slurm/gnu16/mvapich2) |
|---|---|
| Outcome: | Passed |
| Duration: | 1.165 sec |
| Test case: | [libs/HYPRE] 2 PE PCG with SMG preconditioner binary runs under resource manager (slurm/gnu16/mvapich2) |
|---|---|
| Outcome: | Passed |
| Duration: | 1.17 sec |
| Test case: | [libs/HYPRE] 2 PE Semi-Structured PCG binary runs under resource manager (slurm/gnu16/mvapich2) |
|---|---|
| Outcome: | Passed |
| Duration: | 2.222 sec |
| Test case: | [libs/HYPRE] 2 PE Three-part stencil binary runs under resource manager (slurm/gnu16/mvapich2) |
|---|---|
| Outcome: | Passed |
| Duration: | 2.223 sec |
| Test case: | [libs/HYPRE] 2 PE FORTRAN PCG with PFMG preconditioner binary runs under resource manager (slurm/gnu16/mvapich2) |
|---|---|
| Outcome: | Passed |
| Duration: | 2.222 sec |
| Test case: | [libs/HYPRE] 2 PE -Delta u = 1 binary runs under resource manager (slurm/gnu16/mvapich2) |
|---|---|
| Outcome: | Passed |
| Duration: | 2.225 sec |
| Test case: | [libs/HYPRE] 2 PE convection-reaction-diffusion binary runs under resource manager (slurm/gnu16/mvapich2) |
|---|---|
| Outcome: | Passed |
| Duration: | 2.227 sec |
| Test case: | [libs/HYPRE] 2 PE FORTRAN 2-D Laplacian binary runs under resource manager (slurm/gnu16/mvapich2) |
|---|---|
| Outcome: | Passed |
| Duration: | 7.485 sec |
| Test case: | [libs/HYPRE] 2 PE Semi-Structured convection binary runs under resource manager (slurm/gnu16/mvapich2) |
|---|---|
| Outcome: | Skipped |
| Duration: | 0.0 sec |
| Skipped |
skipped
| Test case: | [libs/HYPRE] 2 PE biharmonic binary runs under resource manager (slurm/gnu16/mvapich2) |
|---|---|
| Outcome: | Skipped |
| Duration: | 0.0 sec |
| Skipped |
skipped
| Duration | 0.356 sec |
|---|---|
| Tests | 7 |
| Failures | 0 |
| Test case: | [libs/HYPRE] Verify HYPRE module is loaded and matches rpm version (gnu16/mvapich2) |
|---|---|
| Outcome: | Passed |
| Duration: | 0.232 sec |
| Test case: | [libs/HYPRE] Verify HYPRE_DIR is defined and directory exists (gnu16/mvapich2) |
|---|---|
| Outcome: | Passed |
| Duration: | 0.021 sec |
| Test case: | [libs/HYPRE] Verify module HYPRE_LIB is defined and exists (gnu16/mvapich2) |
|---|---|
| Outcome: | Passed |
| Duration: | 0.022 sec |
| Test case: | [libs/HYPRE] Verify dynamic library available in HYPRE_LIB (gnu16/mvapich2) |
|---|---|
| Outcome: | Passed |
| Duration: | 0.021 sec |
| Test case: | [libs/HYPRE] Verify static library is not present in HYPRE_LIB (gnu16/mvapich2) |
|---|---|
| Outcome: | Passed |
| Duration: | 0.019 sec |
| Duration | 109.559 sec |
|---|---|
| Tests | 12 |
| Failures | 0 |
| Test case: | [libs/HYPRE] 2 PE structured test binary runs under resource manager (slurm/gnu16/openmpi5) |
|---|---|
| Outcome: | Passed |
| Duration: | 8.536 sec |
| Test case: | [libs/HYPRE] 2 PE PCG with SMG preconditioner binary runs under resource manager (slurm/gnu16/openmpi5) |
|---|---|
| Outcome: | Passed |
| Duration: | 10.648 sec |
| Test case: | [libs/HYPRE] 2 PE Semi-Structured PCG binary runs under resource manager (slurm/gnu16/openmpi5) |
|---|---|
| Outcome: | Passed |
| Duration: | 12.755 sec |
| Test case: | [libs/HYPRE] 2 PE Three-part stencil binary runs under resource manager (slurm/gnu16/openmpi5) |
|---|---|
| Outcome: | Passed |
| Duration: | 14.86 sec |
| Test case: | [libs/HYPRE] 2 PE FORTRAN PCG with PFMG preconditioner binary runs under resource manager (slurm/gnu16/openmpi5) |
|---|---|
| Outcome: | Passed |
| Duration: | 13.809 sec |
| Test case: | [libs/HYPRE] 2 PE -Delta u = 1 binary runs under resource manager (slurm/gnu16/openmpi5) |
|---|---|
| Outcome: | Passed |
| Duration: | 13.816 sec |
| Test case: | [libs/HYPRE] 2 PE convection-reaction-diffusion binary runs under resource manager (slurm/gnu16/openmpi5) |
|---|---|
| Outcome: | Passed |
| Duration: | 13.825 sec |
| Test case: | [libs/HYPRE] 2 PE FORTRAN 2-D Laplacian binary runs under resource manager (slurm/gnu16/openmpi5) |
|---|---|
| Outcome: | Passed |
| Duration: | 13.813 sec |
| Test case: | [libs/HYPRE] 2 PE Semi-Structured convection binary runs under resource manager (slurm/gnu16/openmpi5) |
|---|---|
| Outcome: | Skipped |
| Duration: | 0.0 sec |
| Skipped |
skipped
| Test case: | [libs/HYPRE] 2 PE biharmonic binary runs under resource manager (slurm/gnu16/openmpi5) |
|---|---|
| Outcome: | Skipped |
| Duration: | 0.0 sec |
| Skipped |
skipped
| Duration | 0.368 sec |
|---|---|
| Tests | 7 |
| Failures | 0 |
| Test case: | [libs/HYPRE] Verify HYPRE module is loaded and matches rpm version (gnu16/openmpi5) |
|---|---|
| Outcome: | Passed |
| Duration: | 0.242 sec |
| Test case: | [libs/HYPRE] Verify HYPRE_DIR is defined and directory exists (gnu16/openmpi5) |
|---|---|
| Outcome: | Passed |
| Duration: | 0.022 sec |
| Test case: | [libs/HYPRE] Verify module HYPRE_LIB is defined and exists (gnu16/openmpi5) |
|---|---|
| Outcome: | Passed |
| Duration: | 0.021 sec |
| Test case: | [libs/HYPRE] Verify dynamic library available in HYPRE_LIB (gnu16/openmpi5) |
|---|---|
| Outcome: | Passed |
| Duration: | 0.021 sec |
| Test case: | [libs/HYPRE] Verify static library is not present in HYPRE_LIB (gnu16/openmpi5) |
|---|---|
| Outcome: | Passed |
| Duration: | 0.021 sec |
| Duration | 18.959 sec |
|---|---|
| Tests | 12 |
| Failures | 0 |
| Test case: | [libs/HYPRE] 2 PE structured test binary runs under resource manager (slurm/gnu16/mpich) |
|---|---|
| Outcome: | Passed |
| Duration: | 1.171 sec |
| Test case: | [libs/HYPRE] 2 PE PCG with SMG preconditioner binary runs under resource manager (slurm/gnu16/mpich) |
|---|---|
| Outcome: | Passed |
| Duration: | 2.218 sec |
| Test case: | [libs/HYPRE] 2 PE Semi-Structured PCG binary runs under resource manager (slurm/gnu16/mpich) |
|---|---|
| Outcome: | Passed |
| Duration: | 2.226 sec |
| Test case: | [libs/HYPRE] 2 PE Three-part stencil binary runs under resource manager (slurm/gnu16/mpich) |
|---|---|
| Outcome: | Passed |
| Duration: | 2.222 sec |
| Test case: | [libs/HYPRE] 2 PE FORTRAN PCG with PFMG preconditioner binary runs under resource manager (slurm/gnu16/mpich) |
|---|---|
| Outcome: | Passed |
| Duration: | 2.226 sec |
| Test case: | [libs/HYPRE] 2 PE -Delta u = 1 binary runs under resource manager (slurm/gnu16/mpich) |
|---|---|
| Outcome: | Passed |
| Duration: | 1.172 sec |
| Test case: | [libs/HYPRE] 2 PE convection-reaction-diffusion binary runs under resource manager (slurm/gnu16/mpich) |
|---|---|
| Outcome: | Passed |
| Duration: | 2.222 sec |
| Test case: | [libs/HYPRE] 2 PE FORTRAN 2-D Laplacian binary runs under resource manager (slurm/gnu16/mpich) |
|---|---|
| Outcome: | Passed |
| Duration: | 2.226 sec |
| Test case: | [libs/HYPRE] 2 PE Semi-Structured convection binary runs under resource manager (slurm/gnu16/mpich) |
|---|---|
| Outcome: | Skipped |
| Duration: | 0.0 sec |
| Skipped |
skipped
| Test case: | [libs/HYPRE] 2 PE biharmonic binary runs under resource manager (slurm/gnu16/mpich) |
|---|---|
| Outcome: | Skipped |
| Duration: | 0.0 sec |
| Skipped |
skipped
| Duration | 0.348 sec |
|---|---|
| Tests | 7 |
| Failures | 0 |
| Test case: | [libs/HYPRE] Verify HYPRE module is loaded and matches rpm version (gnu16/mpich) |
|---|---|
| Outcome: | Passed |
| Duration: | 0.224 sec |
| Test case: | [libs/HYPRE] Verify HYPRE_DIR is defined and directory exists (gnu16/mpich) |
|---|---|
| Outcome: | Passed |
| Duration: | 0.022 sec |
| Test case: | [libs/HYPRE] Verify module HYPRE_LIB is defined and exists (gnu16/mpich) |
|---|---|
| Outcome: | Passed |
| Duration: | 0.021 sec |
| Test case: | [libs/HYPRE] Verify dynamic library available in HYPRE_LIB (gnu16/mpich) |
|---|---|
| Outcome: | Passed |
| Duration: | 0.02 sec |
| Test case: | [libs/HYPRE] Verify static library is not present in HYPRE_LIB (gnu16/mpich) |
|---|---|
| Outcome: | Passed |
| Duration: | 0.021 sec |
| Duration | 0.287 sec |
|---|---|
| Tests | 9 |
| Failures | 0 |
| Test case: | [libs/Metis] Verify METIS module is loaded and matches rpm version (gnu16) |
|---|---|
| Outcome: | Passed |
| Duration: | 0.196 sec |
| Test case: | [libs/Metis] Verify module METIS_DIR is defined and exists (gnu16) |
|---|---|
| Outcome: | Passed |
| Duration: | 0.011 sec |
| Test case: | [libs/Metis] Verify module METIS_BIN is defined and exists (gnu16) |
|---|---|
| Outcome: | Passed |
| Duration: | 0.012 sec |
| Test case: | [libs/Metis] Verify availability of m2gmetis binary (gnu16) |
|---|---|
| Outcome: | Passed |
| Duration: | 0.026 sec |
| Test case: | [libs/Metis] Verify module METIS_LIB is defined and exists (gnu16) |
|---|---|
| Outcome: | Passed |
| Duration: | 0.009 sec |
| Test case: | [libs/Metis] Verify dynamic library available in METIS_LIB (gnu16) |
|---|---|
| Outcome: | Passed |
| Duration: | 0.008 sec |
| Test case: | [libs/Metis] Verify static library is not present in METIS_LIB (gnu16) |
|---|---|
| Outcome: | Passed |
| Duration: | 0.009 sec |
| Duration | 13.227 sec |
|---|---|
| Tests | 5 |
| Failures | 0 |
| Test case: | [libs/Mumps] C (double precision) runs under resource manager (slurm/gnu16/mpich) |
|---|---|
| Outcome: | Passed |
| Duration: | 2.223 sec |
| Test case: | [libs/Mumps] Fortran (single precision) runs under resource manager (slurm/gnu16/mpich) |
|---|---|
| Outcome: | Passed |
| Duration: | 2.225 sec |
| Test case: | [libs/Mumps] Fortran (double precision) runs under resource manager (slurm/gnu16/mpich) |
|---|---|
| Outcome: | Passed |
| Duration: | 3.276 sec |
| Duration | 18.512 sec |
|---|---|
| Tests | 5 |
| Failures | 0 |
| Test case: | [libs/Mumps] C (double precision) runs under resource manager (slurm/gnu16/openmpi5) |
|---|---|
| Outcome: | Passed |
| Duration: | 3.284 sec |
| Test case: | [libs/Mumps] Fortran (single precision) runs under resource manager (slurm/gnu16/openmpi5) |
|---|---|
| Outcome: | Passed |
| Duration: | 3.279 sec |
| Test case: | [libs/Mumps] Fortran (double precision) runs under resource manager (slurm/gnu16/openmpi5) |
|---|---|
| Outcome: | Passed |
| Duration: | 4.333 sec |
| Duration | 16.386 sec |
|---|---|
| Tests | 5 |
| Failures | 0 |
| Test case: | [libs/Mumps] C (double precision) runs under resource manager (slurm/gnu16/mvapich2) |
|---|---|
| Outcome: | Passed |
| Duration: | 7.487 sec |
| Test case: | [libs/Mumps] Fortran (single precision) runs under resource manager (slurm/gnu16/mvapich2) |
|---|---|
| Outcome: | Passed |
| Duration: | 1.172 sec |
| Test case: | [libs/Mumps] Fortran (double precision) runs under resource manager (slurm/gnu16/mvapich2) |
|---|---|
| Outcome: | Passed |
| Duration: | 2.222 sec |
| Duration | 0.407 sec |
|---|---|
| Tests | 9 |
| Failures | 0 |
| Test case: | [libs/NetCDF] Verify NETCDF module is loaded and matches rpm version (gnu16) |
|---|---|
| Outcome: | Passed |
| Duration: | 0.214 sec |
| Test case: | [libs/NetCDF] Verify module NETCDF_DIR is defined and exists (gnu16) |
|---|---|
| Outcome: | Passed |
| Duration: | 0.02 sec |
| Test case: | [libs/NetCDF] Verify module NETCDF_BIN is defined and exists (gnu16) |
|---|---|
| Outcome: | Passed |
| Duration: | 0.021 sec |
| Test case: | [libs/NetCDF] Verify availability of nc-config binary (gnu16) |
|---|---|
| Outcome: | Passed |
| Duration: | 0.049 sec |
| Test case: | [libs/NetCDF] Verify module NETCDF_LIB is defined and exists (gnu16) |
|---|---|
| Outcome: | Passed |
| Duration: | 0.02 sec |
| Test case: | [libs/NetCDF] Verify dynamic library available in NETCDF_LIB (gnu16) |
|---|---|
| Outcome: | Passed |
| Duration: | 0.021 sec |
| Test case: | [libs/NetCDF] Verify static library is not present in NETCDF_LIB (gnu16) |
|---|---|
| Outcome: | Passed |
| Duration: | 0.02 sec |
| Duration | 0.416 sec |
|---|---|
| Tests | 9 |
| Failures | 0 |
| Test case: | [libs/NetCDF-CXX] Verify NETCDF_CXX module is loaded and matches rpm version (gnu16) |
|---|---|
| Outcome: | Passed |
| Duration: | 0.224 sec |
| Test case: | [libs/NetCDF-CXX] Verify module NETCDF_CXX_DIR is defined and exists (gnu16) |
|---|---|
| Outcome: | Passed |
| Duration: | 0.021 sec |
| Test case: | [libs/NetCDF-CXX] Verify module NETCDF_CXX_BIN is defined and exists (gnu16) |
|---|---|
| Outcome: | Passed |
| Duration: | 0.021 sec |
| Test case: | [libs/NetCDF-CXX] Verify availability of ncxx4-config binary (gnu16) |
|---|---|
| Outcome: | Passed |
| Duration: | 0.048 sec |
| Test case: | [libs/NetCDF-CXX] Verify module NETCDF_CXX_LIB is defined and exists (gnu16) |
|---|---|
| Outcome: | Passed |
| Duration: | 0.021 sec |
| Test case: | [libs/NetCDF-CXX] Verify dynamic library available in NETCDF_CXX_LIB (gnu16) |
|---|---|
| Outcome: | Passed |
| Duration: | 0.02 sec |
| Test case: | [libs/NetCDF-CXX] Verify static library is not present in NETCDF_CXX_LIB (gnu16) |
|---|---|
| Outcome: | Passed |
| Duration: | 0.019 sec |
| Duration | 0.428 sec |
|---|---|
| Tests | 9 |
| Failures | 0 |
| Test case: | [libs/NetCDF-Fortran] Verify NETCDF_FORTRAN module is loaded and matches rpm version (gnu16) |
|---|---|
| Outcome: | Passed |
| Duration: | 0.236 sec |
| Test case: | [libs/NetCDF-Fortran] Verify module NETCDF_FORTRAN_DIR is defined and exists (gnu16) |
|---|---|
| Outcome: | Passed |
| Duration: | 0.022 sec |
| Test case: | [libs/NetCDF-Fortran] Verify module NETCDF_FORTRAN_BIN is defined and exists (gnu16) |
|---|---|
| Outcome: | Passed |
| Duration: | 0.019 sec |
| Test case: | [libs/NetCDF-Fortran] Verify availability of nf-config binary (gnu16) |
|---|---|
| Outcome: | Passed |
| Duration: | 0.046 sec |
| Test case: | [libs/NetCDF-Fortran] Verify module NETCDF_FORTRAN_LIB is defined and exists (gnu16) |
|---|---|
| Outcome: | Passed |
| Duration: | 0.021 sec |
| Test case: | [libs/NetCDF-Fortran] Verify dynamic library available in NETCDF_FORTRAN_LIB (gnu16) |
|---|---|
| Outcome: | Passed |
| Duration: | 0.021 sec |
| Test case: | [libs/NetCDF-Fortran] Verify static library is not present in NETCDF_FORTRAN_LIB (gnu16) |
|---|---|
| Outcome: | Passed |
| Duration: | 0.022 sec |
| Duration | 1.929 sec |
|---|---|
| Tests | 8 |
| Failures | 3 |
| Test case: | [libs/NetCDF] verify nc4/hdf5 available for C interface (gnu16) |
|---|---|
| Outcome: | Passed |
| Duration: | 0.082 sec |
| Test case: | [libs/NetCDF] verify nc4 available for Fortran interface (gnu16) |
|---|---|
| Outcome: | Passed |
| Duration: | 0.063 sec |
| Test case: | [libs/NetCDF] verify nc4 available for C++ interface (gnu16) |
|---|---|
| Outcome: | Skipped |
| Duration: | 0.0 sec |
| Skipped |
option no longer supported
| Test case: | [libs/NetCDF] C write/read (slurm/gnu16) |
|---|---|
| Outcome: | Failed |
| Duration: | 0.533 sec |
| Failed |
(from function `assert_success' in file ./common/test_helper_functions.bash, line 58, in test file test_netcdf, line 98) `assert_success' failed total 1472 drwxr-xr-x. 7 ohpc-test ohpc-test 4096 Oct 9 18:29 . drwxr-xr-x. 7 ohpc-test ohpc-test 4096 Oct 9 18:29 .. -rw-r--r--. 1 ohpc-test ohpc-test 5365 Oct 9 08:10 add.c -rw-r--r--. 1 ohpc-test ohpc-test 1327 Oct 9 08:10 add.h -rw-r--r--. 1 ohpc-test ohpc-test 6352 Oct 9 18:29 add.o -rw-r--r--. 1 ohpc-test ohpc-test 50042 Oct 9 08:10 atttests.c -rw-r--r--. 1 ohpc-test ohpc-test 66560 Oct 9 18:29 atttests.o -rw-r--r--. 1 ohpc-test ohpc-test 24221 Oct 9 08:10 cdftests.c -rw-r--r--. 1 ohpc-test ohpc-test 30904 Oct 9 18:29 cdftests.o lrwxrwxrwx. 1 ohpc-test ohpc-test 16 Oct 9 08:10 common -> ../../../common/ -rw-r--r--. 1 ohpc-test ohpc-test 20 Oct 9 08:10 config.h -rw-r--r--. 1 ohpc-test ohpc-test 2072 Oct 9 08:10 COPYRIGHT -rwxr-xr-x. 1 ohpc-test ohpc-test 16768 Oct 9 18:29 C_read -rw-r--r--. 1 ohpc-test ohpc-test 1942 Oct 9 08:10 C_simple_rd.c -rw-r--r--. 1 ohpc-test ohpc-test 2704 Oct 9 18:29 C_simple_rd.o -rw-r--r--. 1 ohpc-test ohpc-test 2657 Oct 9 08:10 C_simple_wr.c -rw-r--r--. 1 ohpc-test ohpc-test 3696 Oct 9 18:29 C_simple_wr.o -rwxr-xr-x. 1 ohpc-test ohpc-test 16960 Oct 9 18:29 C_write -rwxr-xr-x. 1 ohpc-test ohpc-test 26240 Oct 9 18:29 CXX_read -rwxr-xr-x. 1 ohpc-test ohpc-test 38696 Oct 9 18:29 CXX_write drwxr-xr-x. 2 ohpc-test ohpc-test 4096 Oct 9 18:29 .deps -rw-r--r--. 1 ohpc-test ohpc-test 13880 Oct 9 08:10 dimtests.c -rw-r--r--. 1 ohpc-test ohpc-test 18328 Oct 9 18:29 dimtests.o -rw-r--r--. 1 ohpc-test ohpc-test 3879 Oct 9 08:10 driver.c -rw-r--r--. 1 ohpc-test ohpc-test 6352 Oct 9 18:29 driver.o -rw-r--r--. 1 ohpc-test ohpc-test 1082 Oct 9 08:10 emalloc.c -rw-r--r--. 1 ohpc-test ohpc-test 683 Oct 9 08:10 emalloc.h -rw-r--r--. 1 ohpc-test ohpc-test 2176 Oct 9 18:29 emalloc.o -rw-r--r--. 1 ohpc-test ohpc-test 1509 Oct 9 08:10 error.c -rw-r--r--. 1 ohpc-test ohpc-test 920 Oct 9 08:10 error.h -rw-r--r--. 1 ohpc-test ohpc-test 2480 Oct 9 18:29 error.o -rwxr-xr-x. 1 ohpc-test ohpc-test 17648 Oct 9 18:29 F90_read -rwxr-xr-x. 1 ohpc-test ohpc-test 17496 Oct 9 18:29 F90_write drwxr-xr-x. 2 ohpc-test ohpc-test 132 Oct 9 18:28 family-gnu16 drwxr-xr-x. 2 ohpc-test ohpc-test 4096 Oct 9 18:28 family-gnu16-mpich drwxr-xr-x. 2 ohpc-test ohpc-test 4096 Oct 9 18:28 family-gnu16-mvapich2 drwxr-xr-x. 2 ohpc-test ohpc-test 4096 Oct 9 18:29 family-gnu16-openmpi5 -rw-r--r--. 1 ohpc-test ohpc-test 39418 Oct 9 18:29 Makefile -rw-r--r--. 1 ohpc-test ohpc-test 1100 Oct 9 08:10 Makefile.am -rw-r--r--. 1 ohpc-test ohpc-test 40620 Oct 9 18:29 Makefile.in -rw-r--r--. 1 ohpc-test ohpc-test 1633 Oct 9 08:10 misctest.c -rw-r--r--. 1 ohpc-test ohpc-test 3048 Oct 9 18:29 misctest.o -rwxr-xr-x. 1 ohpc-test ohpc-test 122952 Oct 9 18:29 nctest -rw-r--r--. 1 ohpc-test ohpc-test 43696 Oct 9 18:29 nctest_64bit_offset.nc -rw-r--r--. 1 ohpc-test ohpc-test 43584 Oct 9 18:29 nctest_classic.nc -rw-r--r--. 1 ohpc-test ohpc-test 136067 Oct 9 18:29 nctest_netcdf4.nc -rw-r--r--. 1 ohpc-test ohpc-test 16086 Oct 9 08:10 rec.c -rw-r--r--. 1 ohpc-test ohpc-test 15696 Oct 9 18:29 rec.o -rw-r--r--. 1 ohpc-test ohpc-test 43696 Oct 9 08:10 ref_nctest_64bit_offset.nc -rw-r--r--. 1 ohpc-test ohpc-test 43584 Oct 9 08:10 ref_nctest_classic.nc -rw-r--r--. 1 ohpc-test ohpc-test 6432 Oct 9 18:29 simple_xy.nc -rw-r--r--. 1 ohpc-test ohpc-test 8843 Oct 9 18:29 simple_xy_nc4_f.nc -rw-r--r--. 1 ohpc-test ohpc-test 17173 Oct 9 08:10 simple_xy_nc4.nc.ref -rw-r--r--. 1 ohpc-test ohpc-test 3146 Oct 9 08:10 simple_xy_nc4_rd.f90 -rw-r--r--. 1 ohpc-test ohpc-test 5584 Oct 9 18:29 simple_xy_nc4_rd.o -rw-r--r--. 1 ohpc-test ohpc-test 3307 Oct 9 08:10 simple_xy_nc4_wr.f90 -rw-r--r--. 1 ohpc-test ohpc-test 5088 Oct 9 18:29 simple_xy_nc4_wr.o -rw-r--r--. 1 ohpc-test ohpc-test 1587 Oct 9 08:10 simple_xy_rd.cpp -rw-r--r--. 1 ohpc-test ohpc-test 24512 Oct 9 18:29 simple_xy_rd.o -rw-r--r--. 1 ohpc-test ohpc-test 2477 Oct 9 08:10 simple_xy_wr.cpp -rw-r--r--. 1 ohpc-test ohpc-test 49504 Oct 9 18:29 simple_xy_wr.o -rw-r--r--. 1 ohpc-test ohpc-test 10126 Oct 9 08:10 slabs.c -rw-r--r--. 1 ohpc-test ohpc-test 9944 Oct 9 18:29 slabs.o -rw-r--r--. 1 ohpc-test ohpc-test 32 Oct 9 18:29 temp.tmp -rw-r--r--. 1 ohpc-test ohpc-test 8192 Oct 9 18:29 test2.nc -rw-r--r--. 1 ohpc-test ohpc-test 1605 Oct 9 08:10 testcdf.h -rwxr-xr-x. 1 ohpc-test ohpc-test 3289 Oct 9 08:10 test_C_module -rw-r--r--. 1 ohpc-test ohpc-test 809 Oct 9 18:29 test_C_module.log -rw-r--r--. 1 ohpc-test ohpc-test 1434 Oct 9 18:29 test_C_module.log.xml -rw-r--r--. 1 ohpc-test ohpc-test 82 Oct 9 18:29 test_C_module.trs -rwxr-xr-x. 1 ohpc-test ohpc-test 3267 Oct 9 08:10 test_CXX_module -rw-r--r--. 1 ohpc-test ohpc-test 882 Oct 9 18:29 test_CXX_module.log -rw-r--r--. 1 ohpc-test ohpc-test 1525 Oct 9 18:29 test_CXX_module.log.xml -rw-r--r--. 1 ohpc-test ohpc-test 82 Oct 9 18:29 test_CXX_module.trs -rwxr-xr-x. 1 ohpc-test ohpc-test 3270 Oct 9 08:10 test_Fortran_module -rw-r--r--. 1 ohpc-test ohpc-test 951 Oct 9 18:29 test_Fortran_module.log -rw-r--r--. 1 ohpc-test ohpc-test 1630 Oct 9 18:29 test_Fortran_module.log.xml -rw-r--r--. 1 ohpc-test ohpc-test 82 Oct 9 18:29 test_Fortran_module.trs -rwxr-xr-x. 1 ohpc-test ohpc-test 3865 Oct 9 08:10 test_netcdf -rw-r--r--. 1 ohpc-test ohpc-test 5 Oct 9 18:29 test_netcdf.log -rw-r--r--. 1 ohpc-test ohpc-test 0 Oct 9 18:29 test_netcdf.log.xml -rw-r--r--. 1 ohpc-test ohpc-test 1863 Oct 9 08:10 tests.h -rw-r--r--. 1 ohpc-test ohpc-test 5527 Oct 9 08:10 val.c -rw-r--r--. 1 ohpc-test ohpc-test 1055 Oct 9 08:10 val.h -rw-r--r--. 1 ohpc-test ohpc-test 5320 Oct 9 18:29 val.o -rw-r--r--. 1 ohpc-test ohpc-test 10076 Oct 9 08:10 vardef.c -rw-r--r--. 1 ohpc-test ohpc-test 13472 Oct 9 18:29 vardef.o -rw-r--r--. 1 ohpc-test ohpc-test 4511 Oct 9 08:10 varget.c -rw-r--r--. 1 ohpc-test ohpc-test 4555 Oct 9 08:10 vargetg.c -rw-r--r--. 1 ohpc-test ohpc-test 6096 Oct 9 18:29 vargetg.o -rw-r--r--. 1 ohpc-test ohpc-test 5768 Oct 9 18:29 varget.o -rw-r--r--. 1 ohpc-test ohpc-test 4719 Oct 9 08:10 varput.c -rw-r--r--. 1 ohpc-test ohpc-test 4707 Oct 9 08:10 varputg.c -rw-r--r--. 1 ohpc-test ohpc-test 6208 Oct 9 18:29 varputg.o -rw-r--r--. 1 ohpc-test ohpc-test 5952 Oct 9 18:29 varput.o -rw-r--r--. 1 ohpc-test ohpc-test 21492 Oct 9 08:10 vartests.c -rw-r--r--. 1 ohpc-test ohpc-test 25448 Oct 9 18:29 vartests.o -rw-r--r--. 1 ohpc-test ohpc-test 4450 Oct 9 08:10 vputget.c -rw-r--r--. 1 ohpc-test ohpc-test 6788 Oct 9 08:10 vputgetg.c -rw-r--r--. 1 ohpc-test ohpc-test 8656 Oct 9 18:29 vputgetg.o -rw-r--r--. 1 ohpc-test ohpc-test 5360 Oct 9 18:29 vputget.o -- command failed -- status : 239 output (5 lines): srun: job 279 queued and waiting for resources srun: job 279 has been allocated resources srun: error: Task launch for StepId=279.0 failed on node c1: Protocol authentication error srun: error: Application launch failed: Protocol authentication error srun: Job step aborted --
| Test case: | [libs/NetCDF] Fortran write/read (slurm/gnu16) |
|---|---|
| Outcome: | Failed |
| Duration: | 0.495 sec |
| Failed |
(from function `assert_success' in file ./common/test_helper_functions.bash, line 58,
in test file test_netcdf, line 140)
`assert_success' failed
SHELL=/bin/bash
BATS_RUN_LOGS_DIRECTORY=
TEST_DATA=/tmp/tmp.45eRkf1Y9Z
BATS_TEST_TMPDIR=/tmp/bats-run-whL0ei/test/7
NETCDF_CXX_LIB=/opt/ohpc/pub/libs/gnu16/netcdf-cxx/4.3.1/lib
SUDO_GID=0
HISTCONTROL=ignoredups
OMPI_MCA_rmaps_base_oversubscribe=1
PARALLEL_JOBSLOT0=0
HOSTNAME=ohpc-lenovo-sms
HISTSIZE=1048576
FPATH=/opt/ohpc/admin/lmod/lmod/init/ksh_funcs
BATS_LIBDIR=lib
BATS_SUITE_TMPDIR=/tmp/bats-run-whL0ei/suite
BATS_ROOT_PID=345227
BATS_WARNING_FILE=/tmp/bats-run-whL0ei/warnings.log
BATS_FILE_TMPDIR=/tmp/bats-run-whL0ei/file/0
_ModuleTable002_=Z251MTYiLAp3ViA9ICIwMDAwMDAwMTYuMDAwMDAwMDAyLip6ZmluYWwiLAp9LApoZGY1ID0gewpmbiA9ICIvb3B0L29ocGMvcHViL21vZHVsZWRlcHMvZ251MTYvaGRmNS8yLjIuMCIsCmZ1bGxOYW1lID0gImhkZjUvMi4yLjAiLApsb2FkT3JkZXIgPSAzLApwcm9wVCA9IHt9LApyZWZfY291bnQgPSAxLApzdGFja0RlcHRoID0gMSwKc3RhdHVzID0gImFjdGl2ZSIsCnVzZXJOYW1lID0gImhkZjUiLAp3ViA9ICIwMDAwMDAwMDIuMDAwMDAwMDAyLip6ZmluYWwiLAp9LApuZXRjZGYgPSB7CmRlcFQgPSB7CmRlcEEgPSB7CnsKc24gPSAiaGRmNSIsCnZlcnNpb24gPSB7CmtpbmQgPSAiYm9vbCIsCnZhbHVlID0gdHJ1ZSwKfSwKfSwKfSwKfSwKZm4gPSAiL29wdC9vaHBjL3B1Yi9t
HDF5_DIR=/opt/ohpc/pub/libs/gnu16/hdf5/2.2.0
BATS_SEMAPHORE_DIR=/tmp/bats-run-whL0ei/semaphores
__LMOD_REF_COUNT_MODULEPATH=/opt/ohpc/pub/moduledeps/gnu16:1;/opt/ohpc/pub/modulefiles:1
CXX_DATA=/tmp/tmp.0ware30LL4
_ModuleTable005_=MCwKc3RhdHVzID0gImFjdGl2ZSIsCnVzZXJOYW1lID0gIm5ldGNkZi1mb3J0cmFuIiwKd1YgPSAiMDAwMDAwMDA0LjAwMDAwMDAwNi4wMDAwMDAwMDQuKnpmaW5hbCIsCn0sCnBydW4gPSB7CmZuID0gIi9vcHQvb2hwYy9wdWIvbW9kdWxlZmlsZXMvcHJ1bi8zIiwKZnVsbE5hbWUgPSAicHJ1bi8zIiwKbG9hZE9yZGVyID0gMSwKcHJvcFQgPSB7fSwKc3RhY2tEZXB0aCA9IDAsCnN0YXR1cyA9ICJhY3RpdmUiLAp1c2VyTmFtZSA9ICJwcnVuIiwKd1YgPSAiMDAwMDAwMDAzLip6ZmluYWwiLAp9LAp9LAptcGF0aEEgPSB7CiIvb3B0L29ocGMvcHViL21vZHVsZWRlcHMvZ251MTYiLCAiL29wdC9vaHBjL3B1Yi9tb2R1bGVmaWxlcyIsCn0sCnN5c3RlbUJhc2VNUEFUSCA9ICIvb3B0
TEST_LOGS=test_C_module.log test_CXX_module.log test_Fortran_module.log test_netcdf.log
LMOD_FAMILY_HDF5_VERSION=2.2.0
SSHPASS=
NETCDF_CXX_BIN=/opt/ohpc/pub/libs/gnu16/netcdf-cxx/4.3.1/bin
BATS_END_CODE_QUOTE='
SUDO_COMMAND=/bin/bash -c /tmp/user_integration_tests
SUDO_USER=root
BATS_TEST_SOURCE=/home/ohpc-test/tests/libs/netcdf/tests/test_netcdf
BATS_TEST_NAME=test_-5b-24-7bTESTNAME-7d-5d_Fortran_write-2fread_-28-24RESOURCE-5fMANAGER-2f-24-7bDELIMITER-7d-29
GPG_TTY=not a tty
LMOD_DIR=/opt/ohpc/admin/lmod/lmod/libexec
PWD=/home/ohpc-test/tests/libs/netcdf/tests
LOGNAME=ohpc-test
MODULESHOME=/opt/ohpc/admin/lmod/lmod
PARALLEL_TMP=/tmp/par3HqYO
MANPATH=/opt/ohpc/pub/libs/gnu16/netcdf-fortran/4.6.4/share/man:/opt/ohpc/pub/libs/gnu16/netcdf-cxx/4.3.1/share/man:/opt/ohpc/pub/libs/gnu16/netcdf/4.10.1/share/man:/opt/ohpc/pub/compiler/gcc/16.2.0/share/man:/opt/xcat/share/man:/opt/ohpc/admin/lmod/lmod/share/man::
NETCDF_FORTRAN_DIR=/opt/ohpc/pub/libs/gnu16/netcdf-fortran/4.6.4
BATS_JUNIT_FORMAT=1
CI_CLUSTER=lenovo
LMOD_PREPEND_BLOCK=normal
SUDO_HOME=/root
BATS_TMPDIR=/tmp
__LMOD_REF_COUNT_INCLUDE=/opt/ohpc/pub/libs/gnu16/netcdf-fortran/4.6.4/include:1;/opt/ohpc/pub/libs/gnu16/netcdf-cxx/4.3.1/include:1;/opt/ohpc/pub/libs/gnu16/netcdf/4.10.1/include:1;/opt/ohpc/pub/libs/gnu16/hdf5/2.2.0/include:1;/opt/ohpc/pub/compiler/gcc/16.2.0/include:1
BATS_USE_MKTEMP=1
BATS_TEST_DESCRIPTION=[libs/NetCDF] Fortran write/read (slurm/gnu16)
NETCDF_FORTRAN_INC=/opt/ohpc/pub/libs/gnu16/netcdf-fortran/4.6.4/include
__LMOD_REF_COUNT_PATH=/opt/ohpc/pub/libs/gnu16/netcdf-fortran/4.6.4/bin:1;/opt/ohpc/pub/libs/gnu16/netcdf-cxx/4.3.1/bin:1;/opt/ohpc/pub/libs/gnu16/netcdf/4.10.1/bin:1;/opt/ohpc/pub/libs/gnu16/hdf5/2.2.0/bin:1;/opt/ohpc/pub/compiler/gcc/16.2.0/bin:1;/opt/ohpc/pub/utils/prun/3:1;/home/ohpc-test/.local/bin:1;/home/ohpc-test/bin:1;/opt/xcat/bin:1;/opt/xcat/sbin:1;/opt/xcat/share/xcat/tools:1;/sbin:1;/bin:1;/usr/sbin:1;/usr/bin:1;/usr/local/sbin:1
HOME=/home/ohpc-test
FI_PROVIDER=sockets
PARALLEL_RSYNC_OPTS=-rlDzR
_ModuleTable_Sz_=6
LANG=en_US.UTF-8
BATS_TEST_FILENAME=/home/ohpc-test/tests/libs/netcdf/tests/test_netcdf
srcdir=.
NETCDF_FORTRAN_LIB=/opt/ohpc/pub/libs/gnu16/netcdf-fortran/4.6.4/lib
PARALLEL_PID=345288
BATS_RUN_TMPDIR=/tmp/bats-run-whL0ei
LMOD_SETTARG_FULL_SUPPORT=no
BATS_JUNIT_CLASS=NetCDF
HDF5_INC=/opt/ohpc/pub/libs/gnu16/hdf5/2.2.0/include
BATS_VERSION=1.11.1
TMPDIR=/tmp
F_DATA=/tmp/tmp.2htyy3x79v
https_proxy=http://10.241.58.130:3128
NETCDF_INC=/opt/ohpc/pub/libs/gnu16/netcdf/4.10.1/include
PERL5LIB=/usr/local/share/perl5:
NETCDF_DIR=/opt/ohpc/pub/libs/gnu16/netcdf/4.10.1
XCATROOT=/opt/xcat
LMOD_VERSION=9.4.2
BATS_GUARANTEED_MINIMUM_VERSION=0.0.0
HDF5_BIN=/opt/ohpc/pub/libs/gnu16/hdf5/2.2.0/bin
TESTNAME=libs/NetCDF
SINGULARITY_TMPDIR=/var/tmp
MFLAGS=-k --no-print-directory
_ModuleTable003_=b2R1bGVkZXBzL2dudTE2L25ldGNkZi80LjEwLjEiLApmdWxsTmFtZSA9ICJuZXRjZGYvNC4xMC4xIiwKbG9hZE9yZGVyID0gNCwKcHJvcFQgPSB7fSwKc3RhY2tEZXB0aCA9IDAsCnN0YXR1cyA9ICJhY3RpdmUiLAp1c2VyTmFtZSA9ICJuZXRjZGYiLAp3ViA9ICIwMDAwMDAwMDQuMDAwMDAwMDEwLjAwMDAwMDAwMS4qemZpbmFsIiwKfSwKWyJuZXRjZGYtY3h4Il0gPSB7CmRlcFQgPSB7CmRlcEEgPSB7CnsKc24gPSAibmV0Y2RmIiwKdmVyc2lvbiA9IHsKa2luZCA9ICJib29sIiwKdmFsdWUgPSB0cnVlLAp9LAp9LAp9LAp9LApmbiA9ICIvb3B0L29ocGMvcHViL21vZHVsZWRlcHMvZ251MTYvbmV0Y2RmLWN4eC80LjMuMSIsCmZ1bGxOYW1lID0gIm5ldGNkZi1jeHgvNC4zLjEi
PARALLEL_SEQ=1
AUTOMAKE_JUNIT_FILE=1
BATS_CWD=/home/ohpc-test/tests/libs/netcdf/tests
MAKEFLAGS=k --no-print-directory -- TEST_LOGS=test_C_module.log\ test_CXX_module.log\ test_Fortran_module.log\ test_netcdf.log
LMOD_PKG=/opt/ohpc/admin/lmod/lmod
TERM=unknown
BATS_LINE_REFERENCE_FORMAT=comma_line
NETCDF_FORTRAN_BIN=/opt/ohpc/pub/libs/gnu16/netcdf-fortran/4.6.4/bin
BATS_SEMAPHORE_NUMBER_OF_SLOTS=8
C_DATA=/tmp/tmp.ve5wK4Qd03
LESSOPEN=||/usr/bin/lesspipe.sh %s
NETCDF_CXX_INC=/opt/ohpc/pub/libs/gnu16/netcdf-cxx/4.3.1/include
PARALLEL_SSHLOGIN=:
USER=ohpc-test
PARALLEL_ENABLED=no
BATS_BEGIN_CODE_QUOTE=`
HDF5_LIB=/opt/ohpc/pub/libs/gnu16/hdf5/2.2.0/lib
LOADEDMODULES=prun/3:gnu16/16.2.0:hdf5/2.2.0:netcdf/4.10.1:netcdf-cxx/4.3.1:netcdf-fortran/4.6.4
BATS_TEMPDIR_CLEANUP=1
INCLUDE=/opt/ohpc/pub/libs/gnu16/netcdf-fortran/4.6.4/include:/opt/ohpc/pub/libs/gnu16/netcdf-cxx/4.3.1/include:/opt/ohpc/pub/libs/gnu16/netcdf/4.10.1/include:/opt/ohpc/pub/libs/gnu16/hdf5/2.2.0/include:/opt/ohpc/pub/compiler/gcc/16.2.0/include
LMOD_ROOT=/opt/ohpc/admin/lmod
LMOD_SETTARG_CMD=:
SHLVL=10
BASH_ENV=/opt/ohpc/admin/lmod/lmod/init/bash
_ModuleTable006_=L29ocGMvcHViL21vZHVsZWZpbGVzIiwKfQo=
NETCDF_CXX_DIR=/opt/ohpc/pub/libs/gnu16/netcdf-cxx/4.3.1
BATS_REPORT_FILENAME=test_netcdf.log.xml
MAKELEVEL=8
LMOD_FULL_SETTARG_SUPPORT=no
LMOD_FAMILY_HDF5=hdf5
__LMOD_REF_COUNT_MANPATH=/opt/ohpc/pub/libs/gnu16/netcdf-fortran/4.6.4/share/man:1;/opt/ohpc/pub/libs/gnu16/netcdf-cxx/4.3.1/share/man:1;/opt/ohpc/pub/libs/gnu16/netcdf/4.10.1/share/man:1;/opt/ohpc/pub/compiler/gcc/16.2.0/share/man:1;/opt/xcat/share/man:1;/opt/ohpc/admin/lmod/lmod/share/man:1;:1
http_proxy=http://10.241.58.130:3128
PARALLEL_SSHHOST=:
_ModuleTable001_=X01vZHVsZVRhYmxlXyA9IHsKTVR2ZXJzaW9uID0gMywKY19yZWJ1aWxkVGltZSA9IGZhbHNlLApjX3Nob3J0VGltZSA9IGZhbHNlLApkZXB0aFQgPSB7fSwKZmFtaWx5ID0gewpjb21waWxlciA9ICJnbnUxNiIsCmhkZjUgPSAiaGRmNSIsCn0sCm1UID0gewpnbnUxNiA9IHsKYWN0aW9uQSA9IHsKW1twcmVwZW5kX3BhdGgoIk1PRFVMRVBBVEgiLCIvb3B0L29ocGMvcHViL21vZHVsZWRlcHMvZ251MTYiKV1dLAp9LApmbiA9ICIvb3B0L29ocGMvcHViL21vZHVsZWZpbGVzL2dudTE2LzE2LjIuMCIsCmZ1bGxOYW1lID0gImdudTE2LzE2LjIuMCIsCmxvYWRPcmRlciA9IDIsCnByb3BUID0ge30sCnN0YWNrRGVwdGggPSAwLApzdGF0dXMgPSAiYWN0aXZlIiwKdXNlck5hbWUgPSAi
LD_LIBRARY_PATH=/opt/ohpc/pub/libs/gnu16/netcdf-fortran/4.6.4/lib:/opt/ohpc/pub/libs/gnu16/netcdf-cxx/4.3.1/lib:/opt/ohpc/pub/libs/gnu16/netcdf/4.10.1/lib:/opt/ohpc/pub/libs/gnu16/hdf5/2.2.0/lib:/opt/ohpc/pub/compiler/gcc/16.2.0/lib64
LMOD_FAMILY_COMPILER=gnu16
LMOD_COLORIZE=no
_ModuleTable004_=LApsb2FkT3JkZXIgPSA1LApwcm9wVCA9IHt9LApzdGFja0RlcHRoID0gMCwKc3RhdHVzID0gImFjdGl2ZSIsCnVzZXJOYW1lID0gIm5ldGNkZi1jeHgiLAp3ViA9ICIwMDAwMDAwMDQuMDAwMDAwMDAzLjAwMDAwMDAwMS4qemZpbmFsIiwKfSwKWyJuZXRjZGYtZm9ydHJhbiJdID0gewpkZXBUID0gewpkZXBBID0gewp7CnNuID0gIm5ldGNkZiIsCnZlcnNpb24gPSB7CmtpbmQgPSAiYm9vbCIsCnZhbHVlID0gdHJ1ZSwKfSwKfSwKfSwKfSwKZm4gPSAiL29wdC9vaHBjL3B1Yi9tb2R1bGVkZXBzL2dudTE2L25ldGNkZi1mb3J0cmFuLzQuNi40IiwKZnVsbE5hbWUgPSAibmV0Y2RmLWZvcnRyYW4vNC42LjQiLApsb2FkT3JkZXIgPSA2LApwcm9wVCA9IHt9LApzdGFja0RlcHRoID0g
RESOURCE_MANAGER=slurm
BATS_TEST_RETRIES=0
OMP_NUM_THREADS=2
DEBUGINFOD_IMA_CERT_PATH=/etc/keys/ima:
ALL_ENABLED=yes
BATS_RUNLOG_FILE=/dev/null
PERL_BADLANG=0
LMOD_FAMILY_COMPILER_VERSION=16.2.0
PARALLEL_REMOTE_TMPDIR=/tmp
NETCDF_BIN=/opt/ohpc/pub/libs/gnu16/netcdf/4.10.1/bin
BATS_TEST_NUMBER=7
BATS_ENABLE_TIMING=-T
PATH=/usr/libexec/bats-core:/opt/ohpc/pub/libs/gnu16/netcdf-fortran/4.6.4/bin:/opt/ohpc/pub/libs/gnu16/netcdf-cxx/4.3.1/bin:/opt/ohpc/pub/libs/gnu16/netcdf/4.10.1/bin:/opt/ohpc/pub/libs/gnu16/hdf5/2.2.0/bin:/opt/ohpc/pub/compiler/gcc/16.2.0/bin:/opt/ohpc/pub/utils/prun/3:/home/ohpc-test/.local/bin:/home/ohpc-test/bin:/opt/xcat/bin:/opt/xcat/sbin:/opt/xcat/share/xcat/tools:/sbin:/bin:/usr/sbin:/usr/bin:/usr/local/sbin
NETCDF_LIB=/opt/ohpc/pub/libs/gnu16/netcdf/4.10.1/lib
MODULEPATH=/opt/ohpc/pub/moduledeps/gnu16:/opt/ohpc/pub/modulefiles
_LMFILES_=/opt/ohpc/pub/modulefiles/prun/3:/opt/ohpc/pub/modulefiles/gnu16/16.2.0:/opt/ohpc/pub/moduledeps/gnu16/hdf5/2.2.0:/opt/ohpc/pub/moduledeps/gnu16/netcdf/4.10.1:/opt/ohpc/pub/moduledeps/gnu16/netcdf-cxx/4.3.1:/opt/ohpc/pub/moduledeps/gnu16/netcdf-fortran/4.6.4
SUDO_UID=0
LMOD_CMD=/opt/ohpc/admin/lmod/lmod/libexec/lmod
MAIL=/var/spool/mail/ohpc-test
__LMOD_REF_COUNT_LD_LIBRARY_PATH=/opt/ohpc/pub/libs/gnu16/netcdf-fortran/4.6.4/lib:1;/opt/ohpc/pub/libs/gnu16/netcdf-cxx/4.3.1/lib:1;/opt/ohpc/pub/libs/gnu16/netcdf/4.10.1/lib:1;/opt/ohpc/pub/libs/gnu16/hdf5/2.2.0/lib:1;/opt/ohpc/pub/compiler/gcc/16.2.0/lib64:1
BATS_JUNIT_GROUP=UserLevelTests
BATS_LIB_PATH=/usr/lib/bats
PARALLEL_JOBSLOT=1
BATS_LIBEXEC=/usr/libexec/bats-core
BATS_SUITE_TEST_NUMBER=7
BATS_ROOT=/usr
DELIMITER=gnu16
OLDPWD=/home/ohpc-test/tests/libs/netcdf/tests
VERBOSE=1
BATS_SAVED_PATH=/opt/ohpc/pub/libs/gnu16/netcdf-fortran/4.6.4/bin:/opt/ohpc/pub/libs/gnu16/netcdf-cxx/4.3.1/bin:/opt/ohpc/pub/libs/gnu16/netcdf/4.10.1/bin:/opt/ohpc/pub/libs/gnu16/hdf5/2.2.0/bin:/opt/ohpc/pub/compiler/gcc/16.2.0/bin:/opt/ohpc/pub/utils/prun/3:/home/ohpc-test/.local/bin:/home/ohpc-test/bin:/opt/xcat/bin:/opt/xcat/sbin:/opt/xcat/share/xcat/tools:/sbin:/bin:/usr/sbin:/usr/bin:/usr/local/sbin
BASH_FUNC_ml%%=() { eval "$($LMOD_DIR/ml_cmd "$@")"
}
BASH_FUNC_bats_semaphore_acquire_while_locked%%=() { if [[ $(bats_semaphore_get_free_slot_count) -gt 0 ]]; then
local slot=0;
while [[ -e "$BATS_SEMAPHORE_DIR/slot-$slot" ]]; do
((++slot));
done;
if [[ $slot -lt $BATS_SEMAPHORE_NUMBER_OF_SLOTS ]]; then
touch "$BATS_SEMAPHORE_DIR/slot-$slot" && printf "%d\n" "$slot" && return 0;
fi;
fi;
return 1
}
BASH_FUNC_bats_readlinkf%%=() { readlink -f "$1"
}
BASH_FUNC_clearLmod%%=() { module --force purge;
eval $($LMOD_DIR/clearLMOD_cmd --shell bash --full "$@")
}
BASH_FUNC_bats_semaphore_get_free_slot_count%%=() { until used_slots=$(find "$BATS_SEMAPHORE_DIR" -name 'slot-*' 2> /dev/null | wc -l); do
:;
done;
echo $((BATS_SEMAPHORE_NUMBER_OF_SLOTS - used_slots))
}
BASH_FUNC_module%%=() { if [ -z "${LMOD_SH_DBG_ON+x}" ]; then
case "$-" in
*v*x*)
__lmod_sh_dbg='vx'
;;
*v*)
__lmod_sh_dbg='v'
;;
*x*)
__lmod_sh_dbg='x'
;;
esac;
fi;
if [ -n "${__lmod_sh_dbg:-}" ]; then
set +$__lmod_sh_dbg;
echo "Shell debugging temporarily silenced: export LMOD_SH_DBG_ON=1 for Lmod's output" 1>&2;
fi;
__lmod_internal_module_cmd "$@";
__lmod_my_status=$?;
if [ -n "${__lmod_sh_dbg:-}" ]; then
echo "Shell debugging restarted" 1>&2;
set -$__lmod_sh_dbg;
fi;
unset __lmod_sh_dbg;
return $__lmod_my_status
}
BASH_FUNC___lmod_internal_module_cmd%%=() { eval "$(__LMOD_PROTECTED_LD_LIBRARY_PATH=${LD_LIBRARY_PATH:-} __LMOD_PROTECTED_LD_PRELOAD=${LD_PRELOAD:-} LD_LIBRARY_PATH= LD_PRELOAD= $LMOD_CMD bash --protected_vars "$@")" && eval $(LD_LIBRARY_PATH= LD_PRELOAD= ${LMOD_SETTARG_CMD:-:} -s sh)
}
BASH_FUNC_clearMT%%=() { eval $($LMOD_DIR/clearLMOD_cmd --shell bash --simple)
}
_=/bin/printenv
-- command failed --
status : 239
output (5 lines):
srun: job 281 queued and waiting for resources
srun: job 281 has been allocated resources
srun: error: Task launch for StepId=281.0 failed on node c1: Protocol authentication error
srun: error: Application launch failed: Protocol authentication error
srun: Job step aborted
--
| Test case: | [libs/NetCDF] C++ write/read (slurm/gnu16) |
|---|---|
| Outcome: | Failed |
| Duration: | 0.378 sec |
| Failed |
(from function `assert_success' in file ./common/test_helper_functions.bash, line 58, in test file test_netcdf, line 174) `assert_success' failed -- command failed -- status : 239 output (5 lines): srun: job 280 queued and waiting for resources srun: job 280 has been allocated resources srun: error: Task launch for StepId=280.0 failed on node c2: Protocol authentication error srun: error: Application launch failed: Protocol authentication error srun: Job step aborted --
| Duration | 0.405 sec |
|---|---|
| Tests | 9 |
| Failures | 0 |
| Test case: | [libs/NetCDF] Verify NETCDF module is loaded and matches rpm version (gnu16/mvapich2) |
|---|---|
| Outcome: | Passed |
| Duration: | 0.216 sec |
| Test case: | [libs/NetCDF] Verify module NETCDF_DIR is defined and exists (gnu16/mvapich2) |
|---|---|
| Outcome: | Passed |
| Duration: | 0.018 sec |
| Test case: | [libs/NetCDF] Verify module NETCDF_BIN is defined and exists (gnu16/mvapich2) |
|---|---|
| Outcome: | Passed |
| Duration: | 0.022 sec |
| Test case: | [libs/NetCDF] Verify availability of nc-config binary (gnu16/mvapich2) |
|---|---|
| Outcome: | Passed |
| Duration: | 0.046 sec |
| Test case: | [libs/NetCDF] Verify module NETCDF_LIB is defined and exists (gnu16/mvapich2) |
|---|---|
| Outcome: | Passed |
| Duration: | 0.02 sec |
| Test case: | [libs/NetCDF] Verify dynamic library available in NETCDF_LIB (gnu16/mvapich2) |
|---|---|
| Outcome: | Passed |
| Duration: | 0.022 sec |
| Test case: | [libs/NetCDF] Verify static library is not present in NETCDF_LIB (gnu16/mvapich2) |
|---|---|
| Outcome: | Passed |
| Duration: | 0.021 sec |
| Duration | 0.431 sec |
|---|---|
| Tests | 9 |
| Failures | 0 |
| Test case: | [libs/NetCDF-CXX] Verify NETCDF_CXX module is loaded and matches rpm version (gnu16/mvapich2) |
|---|---|
| Outcome: | Passed |
| Duration: | 0.236 sec |
| Test case: | [libs/NetCDF-CXX] Verify module NETCDF_CXX_DIR is defined and exists (gnu16/mvapich2) |
|---|---|
| Outcome: | Passed |
| Duration: | 0.02 sec |
| Test case: | [libs/NetCDF-CXX] Verify module NETCDF_CXX_BIN is defined and exists (gnu16/mvapich2) |
|---|---|
| Outcome: | Passed |
| Duration: | 0.022 sec |
| Test case: | [libs/NetCDF-CXX] Verify availability of ncxx4-config binary (gnu16/mvapich2) |
|---|---|
| Outcome: | Passed |
| Duration: | 0.048 sec |
| Test case: | [libs/NetCDF-CXX] Verify module NETCDF_CXX_LIB is defined and exists (gnu16/mvapich2) |
|---|---|
| Outcome: | Passed |
| Duration: | 0.021 sec |
| Test case: | [libs/NetCDF-CXX] Verify dynamic library available in NETCDF_CXX_LIB (gnu16/mvapich2) |
|---|---|
| Outcome: | Passed |
| Duration: | 0.021 sec |
| Test case: | [libs/NetCDF-CXX] Verify static library is not present in NETCDF_CXX_LIB (gnu16/mvapich2) |
|---|---|
| Outcome: | Passed |
| Duration: | 0.021 sec |
| Duration | 0.443 sec |
|---|---|
| Tests | 9 |
| Failures | 0 |
| Test case: | [libs/NetCDF-Fortran] Verify NETCDF_FORTRAN module is loaded and matches rpm version (gnu16/mvapich2) |
|---|---|
| Outcome: | Passed |
| Duration: | 0.25 sec |
| Test case: | [libs/NetCDF-Fortran] Verify module NETCDF_FORTRAN_DIR is defined and exists (gnu16/mvapich2) |
|---|---|
| Outcome: | Passed |
| Duration: | 0.021 sec |
| Test case: | [libs/NetCDF-Fortran] Verify module NETCDF_FORTRAN_BIN is defined and exists (gnu16/mvapich2) |
|---|---|
| Outcome: | Passed |
| Duration: | 0.019 sec |
| Test case: | [libs/NetCDF-Fortran] Verify availability of nf-config binary (gnu16/mvapich2) |
|---|---|
| Outcome: | Passed |
| Duration: | 0.049 sec |
| Test case: | [libs/NetCDF-Fortran] Verify module NETCDF_FORTRAN_LIB is defined and exists (gnu16/mvapich2) |
|---|---|
| Outcome: | Passed |
| Duration: | 0.021 sec |
| Test case: | [libs/NetCDF-Fortran] Verify dynamic library available in NETCDF_FORTRAN_LIB (gnu16/mvapich2) |
|---|---|
| Outcome: | Passed |
| Duration: | 0.021 sec |
| Test case: | [libs/NetCDF-Fortran] Verify static library is not present in NETCDF_FORTRAN_LIB (gnu16/mvapich2) |
|---|---|
| Outcome: | Passed |
| Duration: | 0.021 sec |
| Duration | 1.877 sec |
|---|---|
| Tests | 8 |
| Failures | 3 |
| Test case: | [libs/NetCDF] verify nc4/hdf5 available for C interface (gnu16/mvapich2) |
|---|---|
| Outcome: | Passed |
| Duration: | 0.086 sec |
| Test case: | [libs/NetCDF] verify nc4 available for Fortran interface (gnu16/mvapich2) |
|---|---|
| Outcome: | Passed |
| Duration: | 0.062 sec |
| Test case: | [libs/NetCDF] verify nc4 available for C++ interface (gnu16/mvapich2) |
|---|---|
| Outcome: | Skipped |
| Duration: | 0.0 sec |
| Skipped |
option no longer supported
| Test case: | [libs/NetCDF] C write/read (slurm/gnu16/mvapich2) |
|---|---|
| Outcome: | Failed |
| Duration: | 0.491 sec |
| Failed |
(from function `assert_success' in file ./common/test_helper_functions.bash, line 58, in test file test_netcdf, line 98) `assert_success' failed total 1456 drwxr-xr-x. 7 ohpc-test ohpc-test 4096 Oct 9 18:28 . drwxr-xr-x. 7 ohpc-test ohpc-test 4096 Oct 9 18:28 .. -rw-r--r--. 1 ohpc-test ohpc-test 5365 Oct 9 08:10 add.c -rw-r--r--. 1 ohpc-test ohpc-test 1327 Oct 9 08:10 add.h -rw-r--r--. 1 ohpc-test ohpc-test 6352 Oct 9 18:28 add.o -rw-r--r--. 1 ohpc-test ohpc-test 50042 Oct 9 08:10 atttests.c -rw-r--r--. 1 ohpc-test ohpc-test 66560 Oct 9 18:28 atttests.o -rw-r--r--. 1 ohpc-test ohpc-test 24221 Oct 9 08:10 cdftests.c -rw-r--r--. 1 ohpc-test ohpc-test 30904 Oct 9 18:28 cdftests.o lrwxrwxrwx. 1 ohpc-test ohpc-test 16 Oct 9 08:10 common -> ../../../common/ -rw-r--r--. 1 ohpc-test ohpc-test 20 Oct 9 08:10 config.h -rw-r--r--. 1 ohpc-test ohpc-test 2072 Oct 9 08:10 COPYRIGHT -rwxr-xr-x. 1 ohpc-test ohpc-test 16768 Oct 9 18:28 C_read -rw-r--r--. 1 ohpc-test ohpc-test 1942 Oct 9 08:10 C_simple_rd.c -rw-r--r--. 1 ohpc-test ohpc-test 2704 Oct 9 18:28 C_simple_rd.o -rw-r--r--. 1 ohpc-test ohpc-test 2657 Oct 9 08:10 C_simple_wr.c -rw-r--r--. 1 ohpc-test ohpc-test 3696 Oct 9 18:28 C_simple_wr.o -rwxr-xr-x. 1 ohpc-test ohpc-test 16960 Oct 9 18:28 C_write -rwxr-xr-x. 1 ohpc-test ohpc-test 26240 Oct 9 18:28 CXX_read -rwxr-xr-x. 1 ohpc-test ohpc-test 38696 Oct 9 18:28 CXX_write drwxr-xr-x. 2 ohpc-test ohpc-test 4096 Oct 9 18:28 .deps -rw-r--r--. 1 ohpc-test ohpc-test 13880 Oct 9 08:10 dimtests.c -rw-r--r--. 1 ohpc-test ohpc-test 18328 Oct 9 18:28 dimtests.o -rw-r--r--. 1 ohpc-test ohpc-test 3879 Oct 9 08:10 driver.c -rw-r--r--. 1 ohpc-test ohpc-test 6352 Oct 9 18:28 driver.o -rw-r--r--. 1 ohpc-test ohpc-test 1082 Oct 9 08:10 emalloc.c -rw-r--r--. 1 ohpc-test ohpc-test 683 Oct 9 08:10 emalloc.h -rw-r--r--. 1 ohpc-test ohpc-test 2176 Oct 9 18:28 emalloc.o -rw-r--r--. 1 ohpc-test ohpc-test 1509 Oct 9 08:10 error.c -rw-r--r--. 1 ohpc-test ohpc-test 920 Oct 9 08:10 error.h -rw-r--r--. 1 ohpc-test ohpc-test 2480 Oct 9 18:28 error.o -rwxr-xr-x. 1 ohpc-test ohpc-test 17648 Oct 9 18:28 F90_read -rwxr-xr-x. 1 ohpc-test ohpc-test 17496 Oct 9 18:28 F90_write drwxr-xr-x. 2 ohpc-test ohpc-test 132 Oct 9 18:28 family-gnu16 drwxr-xr-x. 2 ohpc-test ohpc-test 4096 Oct 9 18:28 family-gnu16-mpich drwxr-xr-x. 2 ohpc-test ohpc-test 132 Oct 9 18:27 family-gnu16-mvapich2 drwxr-xr-x. 2 ohpc-test ohpc-test 132 Oct 9 18:27 family-gnu16-openmpi5 -rw-r--r--. 1 ohpc-test ohpc-test 39491 Oct 9 18:28 Makefile -rw-r--r--. 1 ohpc-test ohpc-test 1100 Oct 9 08:10 Makefile.am -rw-r--r--. 1 ohpc-test ohpc-test 40620 Oct 9 18:28 Makefile.in -rw-r--r--. 1 ohpc-test ohpc-test 1633 Oct 9 08:10 misctest.c -rw-r--r--. 1 ohpc-test ohpc-test 3048 Oct 9 18:28 misctest.o -rwxr-xr-x. 1 ohpc-test ohpc-test 122952 Oct 9 18:28 nctest -rw-r--r--. 1 ohpc-test ohpc-test 43696 Oct 9 18:28 nctest_64bit_offset.nc -rw-r--r--. 1 ohpc-test ohpc-test 43584 Oct 9 18:28 nctest_classic.nc -rw-r--r--. 1 ohpc-test ohpc-test 136067 Oct 9 18:28 nctest_netcdf4.nc -rw-r--r--. 1 ohpc-test ohpc-test 16086 Oct 9 08:10 rec.c -rw-r--r--. 1 ohpc-test ohpc-test 15696 Oct 9 18:28 rec.o -rw-r--r--. 1 ohpc-test ohpc-test 43696 Oct 9 08:10 ref_nctest_64bit_offset.nc -rw-r--r--. 1 ohpc-test ohpc-test 43584 Oct 9 08:10 ref_nctest_classic.nc -rw-r--r--. 1 ohpc-test ohpc-test 8843 Oct 9 18:28 simple_xy_nc4_f.nc -rw-r--r--. 1 ohpc-test ohpc-test 17173 Oct 9 08:10 simple_xy_nc4.nc.ref -rw-r--r--. 1 ohpc-test ohpc-test 3146 Oct 9 08:10 simple_xy_nc4_rd.f90 -rw-r--r--. 1 ohpc-test ohpc-test 5584 Oct 9 18:28 simple_xy_nc4_rd.o -rw-r--r--. 1 ohpc-test ohpc-test 3307 Oct 9 08:10 simple_xy_nc4_wr.f90 -rw-r--r--. 1 ohpc-test ohpc-test 5088 Oct 9 18:28 simple_xy_nc4_wr.o -rw-r--r--. 1 ohpc-test ohpc-test 1587 Oct 9 08:10 simple_xy_rd.cpp -rw-r--r--. 1 ohpc-test ohpc-test 24512 Oct 9 18:28 simple_xy_rd.o -rw-r--r--. 1 ohpc-test ohpc-test 2477 Oct 9 08:10 simple_xy_wr.cpp -rw-r--r--. 1 ohpc-test ohpc-test 49504 Oct 9 18:28 simple_xy_wr.o -rw-r--r--. 1 ohpc-test ohpc-test 10126 Oct 9 08:10 slabs.c -rw-r--r--. 1 ohpc-test ohpc-test 9944 Oct 9 18:28 slabs.o -rw-r--r--. 1 ohpc-test ohpc-test 32 Oct 9 18:28 temp.tmp -rw-r--r--. 1 ohpc-test ohpc-test 8192 Oct 9 18:28 test2.nc -rw-r--r--. 1 ohpc-test ohpc-test 1605 Oct 9 08:10 testcdf.h -rwxr-xr-x. 1 ohpc-test ohpc-test 3289 Oct 9 08:10 test_C_module -rw-r--r--. 1 ohpc-test ohpc-test 890 Oct 9 18:28 test_C_module.log -rw-r--r--. 1 ohpc-test ohpc-test 1515 Oct 9 18:28 test_C_module.log.xml -rw-r--r--. 1 ohpc-test ohpc-test 82 Oct 9 18:28 test_C_module.trs -rwxr-xr-x. 1 ohpc-test ohpc-test 3267 Oct 9 08:10 test_CXX_module -rw-r--r--. 1 ohpc-test ohpc-test 963 Oct 9 18:28 test_CXX_module.log -rw-r--r--. 1 ohpc-test ohpc-test 1606 Oct 9 18:28 test_CXX_module.log.xml -rw-r--r--. 1 ohpc-test ohpc-test 82 Oct 9 18:28 test_CXX_module.trs -rwxr-xr-x. 1 ohpc-test ohpc-test 3270 Oct 9 08:10 test_Fortran_module -rw-r--r--. 1 ohpc-test ohpc-test 1032 Oct 9 18:28 test_Fortran_module.log -rw-r--r--. 1 ohpc-test ohpc-test 1711 Oct 9 18:28 test_Fortran_module.log.xml -rw-r--r--. 1 ohpc-test ohpc-test 82 Oct 9 18:28 test_Fortran_module.trs -rwxr-xr-x. 1 ohpc-test ohpc-test 3865 Oct 9 08:10 test_netcdf -rw-r--r--. 1 ohpc-test ohpc-test 5 Oct 9 18:28 test_netcdf.log -rw-r--r--. 1 ohpc-test ohpc-test 0 Oct 9 18:28 test_netcdf.log.xml -rw-r--r--. 1 ohpc-test ohpc-test 1863 Oct 9 08:10 tests.h -rw-r--r--. 1 ohpc-test ohpc-test 5527 Oct 9 08:10 val.c -rw-r--r--. 1 ohpc-test ohpc-test 1055 Oct 9 08:10 val.h -rw-r--r--. 1 ohpc-test ohpc-test 5320 Oct 9 18:28 val.o -rw-r--r--. 1 ohpc-test ohpc-test 10076 Oct 9 08:10 vardef.c -rw-r--r--. 1 ohpc-test ohpc-test 13472 Oct 9 18:28 vardef.o -rw-r--r--. 1 ohpc-test ohpc-test 4511 Oct 9 08:10 varget.c -rw-r--r--. 1 ohpc-test ohpc-test 4555 Oct 9 08:10 vargetg.c -rw-r--r--. 1 ohpc-test ohpc-test 6096 Oct 9 18:28 vargetg.o -rw-r--r--. 1 ohpc-test ohpc-test 5768 Oct 9 18:28 varget.o -rw-r--r--. 1 ohpc-test ohpc-test 4719 Oct 9 08:10 varput.c -rw-r--r--. 1 ohpc-test ohpc-test 4707 Oct 9 08:10 varputg.c -rw-r--r--. 1 ohpc-test ohpc-test 6208 Oct 9 18:28 varputg.o -rw-r--r--. 1 ohpc-test ohpc-test 5952 Oct 9 18:28 varput.o -rw-r--r--. 1 ohpc-test ohpc-test 21492 Oct 9 08:10 vartests.c -rw-r--r--. 1 ohpc-test ohpc-test 25448 Oct 9 18:28 vartests.o -rw-r--r--. 1 ohpc-test ohpc-test 4450 Oct 9 08:10 vputget.c -rw-r--r--. 1 ohpc-test ohpc-test 6788 Oct 9 08:10 vputgetg.c -rw-r--r--. 1 ohpc-test ohpc-test 8656 Oct 9 18:28 vputgetg.o -rw-r--r--. 1 ohpc-test ohpc-test 5360 Oct 9 18:28 vputget.o -- command failed -- status : 239 output (5 lines): srun: job 266 queued and waiting for resources srun: job 266 has been allocated resources srun: error: Task launch for StepId=266.0 failed on node c1: Protocol authentication error srun: error: Application launch failed: Protocol authentication error srun: Job step aborted --
| Test case: | [libs/NetCDF] Fortran write/read (slurm/gnu16/mvapich2) |
|---|---|
| Outcome: | Failed |
| Duration: | 0.552 sec |
| Failed |
(from function `assert_success' in file ./common/test_helper_functions.bash, line 58,
in test file test_netcdf, line 140)
`assert_success' failed
SHELL=/bin/bash
BATS_RUN_LOGS_DIRECTORY=
TEST_DATA=/tmp/tmp.MKduResgqu
BATS_TEST_TMPDIR=/tmp/bats-run-j6SHTb/test/7
NETCDF_CXX_LIB=/opt/ohpc/pub/libs/gnu16/mvapich2/netcdf-cxx/4.3.1/lib
SUDO_GID=0
HISTCONTROL=ignoredups
OMPI_MCA_rmaps_base_oversubscribe=1
PARALLEL_JOBSLOT0=0
PKG_CONFIG_PATH=/opt/ohpc/pub/mpi/mvapich2-gnu16/4.1/lib/pkgconfig
HOSTNAME=ohpc-lenovo-sms
HISTSIZE=1048576
FPATH=/opt/ohpc/admin/lmod/lmod/init/ksh_funcs
BATS_LIBDIR=lib
BATS_SUITE_TMPDIR=/tmp/bats-run-j6SHTb/suite
BATS_ROOT_PID=336987
BATS_WARNING_FILE=/tmp/bats-run-j6SHTb/warnings.log
BATS_FILE_TMPDIR=/tmp/bats-run-j6SHTb/file/0
_ModuleTable007_=CnN5c3RlbUJhc2VNUEFUSCA9ICIvb3B0L29ocGMvcHViL21vZHVsZWZpbGVzIiwKfQo=
_ModuleTable002_=dGl2ZSIsCnVzZXJOYW1lID0gImdudTE2IiwKd1YgPSAiMDAwMDAwMDE2LjAwMDAwMDAwMi4qemZpbmFsIiwKfSwKbXZhcGljaDIgPSB7CmFjdGlvbkEgPSB7CltbcHJlcGVuZF9wYXRoKCJNT0RVTEVQQVRIIiwiL29wdC9vaHBjL3B1Yi9tb2R1bGVkZXBzL2dudTE2LW12YXBpY2gyIildXSwKfSwKZm4gPSAiL29wdC9vaHBjL3B1Yi9tb2R1bGVkZXBzL2dudTE2L212YXBpY2gyLzQuMSIsCmZ1bGxOYW1lID0gIm12YXBpY2gyLzQuMSIsCmxvYWRPcmRlciA9IDMsCnByb3BUID0ge30sCnN0YWNrRGVwdGggPSAwLApzdGF0dXMgPSAiYWN0aXZlIiwKdXNlck5hbWUgPSAibXZhcGljaDIiLAp3ViA9ICIwMDAwMDAwMDQuMDAwMDAwMDAxLip6ZmluYWwiLAp9LApuZXRjZGYgPSB7CmRl
HDF5_DIR=/opt/ohpc/pub/libs/gnu16/mvapich2/phdf5/2.2.0
BATS_SEMAPHORE_DIR=/tmp/bats-run-j6SHTb/semaphores
__LMOD_REF_COUNT_MODULEPATH=/opt/ohpc/pub/moduledeps/gnu16-mvapich2:1;/opt/ohpc/pub/moduledeps/gnu16:1;/opt/ohpc/pub/modulefiles:1
CXX_DATA=/tmp/tmp.GKW9m4jwC2
_ModuleTable005_=b2hwYy9wdWIvbW9kdWxlZGVwcy9nbnUxNi1tdmFwaWNoMi9uZXRjZGYtZm9ydHJhbi80LjYuNCIsCmZ1bGxOYW1lID0gIm5ldGNkZi1mb3J0cmFuLzQuNi40IiwKbG9hZE9yZGVyID0gNywKcHJvcFQgPSB7fSwKc3RhY2tEZXB0aCA9IDAsCnN0YXR1cyA9ICJhY3RpdmUiLAp1c2VyTmFtZSA9ICJuZXRjZGYtZm9ydHJhbiIsCndWID0gIjAwMDAwMDAwNC4wMDAwMDAwMDYuMDAwMDAwMDA0Lip6ZmluYWwiLAp9LApwaGRmNSA9IHsKZm4gPSAiL29wdC9vaHBjL3B1Yi9tb2R1bGVkZXBzL2dudTE2LW12YXBpY2gyL3BoZGY1LzIuMi4wIiwKZnVsbE5hbWUgPSAicGhkZjUvMi4yLjAiLApsb2FkT3JkZXIgPSA0LApwcm9wVCA9IHt9LApyZWZfY291bnQgPSAxLApzdGFja0RlcHRoID0g
TEST_LOGS=test_C_module.log test_CXX_module.log test_Fortran_module.log test_netcdf.log
LMOD_FAMILY_HDF5_VERSION=2.2.0
SSHPASS=
NETCDF_CXX_BIN=/opt/ohpc/pub/libs/gnu16/mvapich2/netcdf-cxx/4.3.1/bin
BATS_END_CODE_QUOTE='
SUDO_COMMAND=/bin/bash -c /tmp/user_integration_tests
SUDO_USER=root
BATS_TEST_SOURCE=/home/ohpc-test/tests/libs/netcdf/tests/test_netcdf
BATS_TEST_NAME=test_-5b-24-7bTESTNAME-7d-5d_Fortran_write-2fread_-28-24RESOURCE-5fMANAGER-2f-24-7bDELIMITER-7d-29
GPG_TTY=not a tty
LMOD_DIR=/opt/ohpc/admin/lmod/lmod/libexec
PWD=/home/ohpc-test/tests/libs/netcdf/tests
LOGNAME=ohpc-test
MODULESHOME=/opt/ohpc/admin/lmod/lmod
PARALLEL_TMP=/tmp/par93Lz6
MANPATH=/opt/ohpc/pub/libs/gnu16/mvapich2/netcdf-fortran/4.6.4/share/man:/opt/ohpc/pub/libs/gnu16/mvapich2/netcdf-cxx/4.3.1/share/man:/opt/ohpc/pub/libs/gnu16/mvapich2/netcdf/4.10.1/share/man:/opt/ohpc/pub/mpi/mvapich2-gnu16/4.1/share/man:/opt/ohpc/pub/compiler/gcc/16.2.0/share/man:/opt/xcat/share/man:/opt/ohpc/admin/lmod/lmod/share/man::
NETCDF_FORTRAN_DIR=/opt/ohpc/pub/libs/gnu16/mvapich2/netcdf-fortran/4.6.4
BATS_JUNIT_FORMAT=1
CI_CLUSTER=lenovo
LMOD_PREPEND_BLOCK=normal
SUDO_HOME=/root
BATS_TMPDIR=/tmp
__LMOD_REF_COUNT_INCLUDE=/opt/ohpc/pub/libs/gnu16/mvapich2/netcdf-fortran/4.6.4/include:1;/opt/ohpc/pub/libs/gnu16/mvapich2/netcdf-cxx/4.3.1/include:1;/opt/ohpc/pub/libs/gnu16/mvapich2/netcdf/4.10.1/include:1;/opt/ohpc/pub/libs/gnu16/mvapich2/phdf5/2.2.0/include:1;/opt/ohpc/pub/compiler/gcc/16.2.0/include:1
BATS_USE_MKTEMP=1
BATS_TEST_DESCRIPTION=[libs/NetCDF] Fortran write/read (slurm/gnu16/mvapich2)
NETCDF_FORTRAN_INC=/opt/ohpc/pub/libs/gnu16/mvapich2/netcdf-fortran/4.6.4/include
__LMOD_REF_COUNT_PATH=/opt/ohpc/pub/libs/gnu16/mvapich2/netcdf-fortran/4.6.4/bin:1;/opt/ohpc/pub/libs/gnu16/mvapich2/netcdf-cxx/4.3.1/bin:1;/opt/ohpc/pub/libs/gnu16/mvapich2/netcdf/4.10.1/bin:1;/opt/ohpc/pub/libs/gnu16/mvapich2/phdf5/2.2.0/bin:1;/opt/ohpc/pub/mpi/mvapich2-gnu16/4.1/bin:1;/opt/ohpc/pub/compiler/gcc/16.2.0/bin:1;/opt/ohpc/pub/utils/prun/3:1;/home/ohpc-test/.local/bin:1;/home/ohpc-test/bin:1;/opt/xcat/bin:1;/opt/xcat/sbin:1;/opt/xcat/share/xcat/tools:1;/sbin:1;/bin:1;/usr/sbin:1;/usr/bin:1;/usr/local/sbin:1
HOME=/home/ohpc-test
FI_PROVIDER=sockets
PARALLEL_RSYNC_OPTS=-rlDzR
_ModuleTable_Sz_=7
LANG=en_US.UTF-8
BATS_TEST_FILENAME=/home/ohpc-test/tests/libs/netcdf/tests/test_netcdf
__LMOD_REF_COUNT_PKG_CONFIG_PATH=/opt/ohpc/pub/mpi/mvapich2-gnu16/4.1/lib/pkgconfig:1
srcdir=.
NETCDF_FORTRAN_LIB=/opt/ohpc/pub/libs/gnu16/mvapich2/netcdf-fortran/4.6.4/lib
PARALLEL_PID=337048
BATS_RUN_TMPDIR=/tmp/bats-run-j6SHTb
LMOD_SETTARG_FULL_SUPPORT=no
BATS_JUNIT_CLASS=NetCDF
HDF5_INC=/opt/ohpc/pub/libs/gnu16/mvapich2/phdf5/2.2.0/include
BATS_VERSION=1.11.1
TMPDIR=/tmp
F_DATA=/tmp/tmp.NqJF4lF98X
https_proxy=http://10.241.58.130:3128
NETCDF_INC=/opt/ohpc/pub/libs/gnu16/mvapich2/netcdf/4.10.1/include
PERL5LIB=/usr/local/share/perl5:
NETCDF_DIR=/opt/ohpc/pub/libs/gnu16/mvapich2/netcdf/4.10.1
XCATROOT=/opt/xcat
LMOD_VERSION=9.4.2
BATS_GUARANTEED_MINIMUM_VERSION=0.0.0
HDF5_BIN=/opt/ohpc/pub/libs/gnu16/mvapich2/phdf5/2.2.0/bin
TESTNAME=libs/NetCDF
SINGULARITY_TMPDIR=/var/tmp
MFLAGS=-k --no-print-directory
_ModuleTable003_=cFQgPSB7CmRlcEEgPSB7CnsKc24gPSAicGhkZjUiLAp2ZXJzaW9uID0gewpraW5kID0gImJvb2wiLAp2YWx1ZSA9IHRydWUsCn0sCn0sCn0sCn0sCmZuID0gIi9vcHQvb2hwYy9wdWIvbW9kdWxlZGVwcy9nbnUxNi1tdmFwaWNoMi9uZXRjZGYvNC4xMC4xIiwKZnVsbE5hbWUgPSAibmV0Y2RmLzQuMTAuMSIsCmxvYWRPcmRlciA9IDUsCnByb3BUID0ge30sCnN0YWNrRGVwdGggPSAwLApzdGF0dXMgPSAiYWN0aXZlIiwKdXNlck5hbWUgPSAibmV0Y2RmIiwKd1YgPSAiMDAwMDAwMDA0LjAwMDAwMDAxMC4wMDAwMDAwMDEuKnpmaW5hbCIsCn0sClsibmV0Y2RmLWN4eCJdID0gewpkZXBUID0gewpkZXBBID0gewp7CnNuID0gIm5ldGNkZiIsCnZlcnNpb24gPSB7CmtpbmQgPSAiYm9v
PARALLEL_SEQ=1
__LMOD_REF_COUNT_MPI_DIR=/opt/ohpc/pub/mpi/mvapich2-gnu16/4.1:1
AUTOMAKE_JUNIT_FILE=1
BATS_CWD=/home/ohpc-test/tests/libs/netcdf/tests
MAKEFLAGS=k --no-print-directory -- TEST_LOGS=test_C_module.log\ test_CXX_module.log\ test_Fortran_module.log\ test_netcdf.log
LMOD_PKG=/opt/ohpc/admin/lmod/lmod
TERM=unknown
BATS_LINE_REFERENCE_FORMAT=comma_line
NETCDF_FORTRAN_BIN=/opt/ohpc/pub/libs/gnu16/mvapich2/netcdf-fortran/4.6.4/bin
BATS_SEMAPHORE_NUMBER_OF_SLOTS=8
C_DATA=/tmp/tmp.BDtiGtRRVf
LESSOPEN=||/usr/bin/lesspipe.sh %s
NETCDF_CXX_INC=/opt/ohpc/pub/libs/gnu16/mvapich2/netcdf-cxx/4.3.1/include
PARALLEL_SSHLOGIN=:
USER=ohpc-test
PARALLEL_ENABLED=yes
BATS_BEGIN_CODE_QUOTE=`
HDF5_LIB=/opt/ohpc/pub/libs/gnu16/mvapich2/phdf5/2.2.0/lib
LOADEDMODULES=prun/3:gnu16/16.2.0:mvapich2/4.1:phdf5/2.2.0:netcdf/4.10.1:netcdf-cxx/4.3.1:netcdf-fortran/4.6.4
BATS_TEMPDIR_CLEANUP=1
INCLUDE=/opt/ohpc/pub/libs/gnu16/mvapich2/netcdf-fortran/4.6.4/include:/opt/ohpc/pub/libs/gnu16/mvapich2/netcdf-cxx/4.3.1/include:/opt/ohpc/pub/libs/gnu16/mvapich2/netcdf/4.10.1/include:/opt/ohpc/pub/libs/gnu16/mvapich2/phdf5/2.2.0/include:/opt/ohpc/pub/compiler/gcc/16.2.0/include
LMOD_ROOT=/opt/ohpc/admin/lmod
LMOD_SETTARG_CMD=:
SHLVL=10
BASH_ENV=/opt/ohpc/admin/lmod/lmod/init/bash
_ModuleTable006_=MSwKc3RhdHVzID0gImFjdGl2ZSIsCnVzZXJOYW1lID0gInBoZGY1IiwKd1YgPSAiMDAwMDAwMDAyLjAwMDAwMDAwMi4qemZpbmFsIiwKfSwKcHJ1biA9IHsKZm4gPSAiL29wdC9vaHBjL3B1Yi9tb2R1bGVmaWxlcy9wcnVuLzMiLApmdWxsTmFtZSA9ICJwcnVuLzMiLApsb2FkT3JkZXIgPSAxLApwcm9wVCA9IHt9LApzdGFja0RlcHRoID0gMCwKc3RhdHVzID0gImFjdGl2ZSIsCnVzZXJOYW1lID0gInBydW4iLAp3ViA9ICIwMDAwMDAwMDMuKnpmaW5hbCIsCn0sCn0sCm1wYXRoQSA9IHsKIi9vcHQvb2hwYy9wdWIvbW9kdWxlZGVwcy9nbnUxNi1tdmFwaWNoMiIsICIvb3B0L29ocGMvcHViL21vZHVsZWRlcHMvZ251MTYiLCAiL29wdC9vaHBjL3B1Yi9tb2R1bGVmaWxlcyIsCn0s
NETCDF_CXX_DIR=/opt/ohpc/pub/libs/gnu16/mvapich2/netcdf-cxx/4.3.1
BATS_REPORT_FILENAME=test_netcdf.log.xml
MAKELEVEL=8
LMOD_FULL_SETTARG_SUPPORT=no
MPI_DIR=/opt/ohpc/pub/mpi/mvapich2-gnu16/4.1
LMOD_FAMILY_HDF5=phdf5
__LMOD_REF_COUNT_MANPATH=/opt/ohpc/pub/libs/gnu16/mvapich2/netcdf-fortran/4.6.4/share/man:1;/opt/ohpc/pub/libs/gnu16/mvapich2/netcdf-cxx/4.3.1/share/man:1;/opt/ohpc/pub/libs/gnu16/mvapich2/netcdf/4.10.1/share/man:1;/opt/ohpc/pub/mpi/mvapich2-gnu16/4.1/share/man:1;/opt/ohpc/pub/compiler/gcc/16.2.0/share/man:1;/opt/xcat/share/man:1;/opt/ohpc/admin/lmod/lmod/share/man:1;:1
http_proxy=http://10.241.58.130:3128
PARALLEL_SSHHOST=:
_ModuleTable001_=X01vZHVsZVRhYmxlXyA9IHsKTVR2ZXJzaW9uID0gMywKY19yZWJ1aWxkVGltZSA9IGZhbHNlLApjX3Nob3J0VGltZSA9IGZhbHNlLApkZXB0aFQgPSB7fSwKZmFtaWx5ID0gewpNUEkgPSAibXZhcGljaDIiLApjb21waWxlciA9ICJnbnUxNiIsCmhkZjUgPSAicGhkZjUiLAp9LAptVCA9IHsKZ251MTYgPSB7CmFjdGlvbkEgPSB7CltbcHJlcGVuZF9wYXRoKCJNT0RVTEVQQVRIIiwiL29wdC9vaHBjL3B1Yi9tb2R1bGVkZXBzL2dudTE2IildXSwKfSwKZm4gPSAiL29wdC9vaHBjL3B1Yi9tb2R1bGVmaWxlcy9nbnUxNi8xNi4yLjAiLApmdWxsTmFtZSA9ICJnbnUxNi8xNi4yLjAiLApsb2FkT3JkZXIgPSAyLApwcm9wVCA9IHt9LApzdGFja0RlcHRoID0gMCwKc3RhdHVzID0gImFj
LD_LIBRARY_PATH=/opt/ohpc/pub/libs/gnu16/mvapich2/netcdf-fortran/4.6.4/lib:/opt/ohpc/pub/libs/gnu16/mvapich2/netcdf-cxx/4.3.1/lib:/opt/ohpc/pub/libs/gnu16/mvapich2/netcdf/4.10.1/lib:/opt/ohpc/pub/libs/gnu16/mvapich2/phdf5/2.2.0/lib:/opt/ohpc/pub/mpi/mvapich2-gnu16/4.1/lib:/opt/ohpc/pub/compiler/gcc/16.2.0/lib64
LMOD_FAMILY_COMPILER=gnu16
LMOD_COLORIZE=no
_ModuleTable004_=bCIsCnZhbHVlID0gdHJ1ZSwKfSwKfSwKfSwKfSwKZm4gPSAiL29wdC9vaHBjL3B1Yi9tb2R1bGVkZXBzL2dudTE2LW12YXBpY2gyL25ldGNkZi1jeHgvNC4zLjEiLApmdWxsTmFtZSA9ICJuZXRjZGYtY3h4LzQuMy4xIiwKbG9hZE9yZGVyID0gNiwKcHJvcFQgPSB7fSwKc3RhY2tEZXB0aCA9IDAsCnN0YXR1cyA9ICJhY3RpdmUiLAp1c2VyTmFtZSA9ICJuZXRjZGYtY3h4IiwKd1YgPSAiMDAwMDAwMDA0LjAwMDAwMDAwMy4wMDAwMDAwMDEuKnpmaW5hbCIsCn0sClsibmV0Y2RmLWZvcnRyYW4iXSA9IHsKZGVwVCA9IHsKZGVwQSA9IHsKewpzbiA9ICJuZXRjZGYiLAp2ZXJzaW9uID0gewpraW5kID0gImJvb2wiLAp2YWx1ZSA9IHRydWUsCn0sCn0sCn0sCn0sCmZuID0gIi9vcHQv
LMOD_FAMILY_MPI_VERSION=4.1
RESOURCE_MANAGER=slurm
BATS_TEST_RETRIES=0
OMP_NUM_THREADS=2
LMOD_FAMILY_MPI=mvapich2
DEBUGINFOD_IMA_CERT_PATH=/etc/keys/ima:
ALL_ENABLED=yes
BATS_RUNLOG_FILE=/dev/null
PERL_BADLANG=0
LMOD_FAMILY_COMPILER_VERSION=16.2.0
PARALLEL_REMOTE_TMPDIR=/tmp
NETCDF_BIN=/opt/ohpc/pub/libs/gnu16/mvapich2/netcdf/4.10.1/bin
BATS_TEST_NUMBER=7
BATS_ENABLE_TIMING=-T
PATH=/usr/libexec/bats-core:/opt/ohpc/pub/libs/gnu16/mvapich2/netcdf-fortran/4.6.4/bin:/opt/ohpc/pub/libs/gnu16/mvapich2/netcdf-cxx/4.3.1/bin:/opt/ohpc/pub/libs/gnu16/mvapich2/netcdf/4.10.1/bin:/opt/ohpc/pub/libs/gnu16/mvapich2/phdf5/2.2.0/bin:/opt/ohpc/pub/mpi/mvapich2-gnu16/4.1/bin:/opt/ohpc/pub/compiler/gcc/16.2.0/bin:/opt/ohpc/pub/utils/prun/3:/home/ohpc-test/.local/bin:/home/ohpc-test/bin:/opt/xcat/bin:/opt/xcat/sbin:/opt/xcat/share/xcat/tools:/sbin:/bin:/usr/sbin:/usr/bin:/usr/local/sbin
NETCDF_LIB=/opt/ohpc/pub/libs/gnu16/mvapich2/netcdf/4.10.1/lib
MODULEPATH=/opt/ohpc/pub/moduledeps/gnu16-mvapich2:/opt/ohpc/pub/moduledeps/gnu16:/opt/ohpc/pub/modulefiles
_LMFILES_=/opt/ohpc/pub/modulefiles/prun/3:/opt/ohpc/pub/modulefiles/gnu16/16.2.0:/opt/ohpc/pub/moduledeps/gnu16/mvapich2/4.1:/opt/ohpc/pub/moduledeps/gnu16-mvapich2/phdf5/2.2.0:/opt/ohpc/pub/moduledeps/gnu16-mvapich2/netcdf/4.10.1:/opt/ohpc/pub/moduledeps/gnu16-mvapich2/netcdf-cxx/4.3.1:/opt/ohpc/pub/moduledeps/gnu16-mvapich2/netcdf-fortran/4.6.4
SUDO_UID=0
LMOD_CMD=/opt/ohpc/admin/lmod/lmod/libexec/lmod
MAIL=/var/spool/mail/ohpc-test
__LMOD_REF_COUNT_LD_LIBRARY_PATH=/opt/ohpc/pub/libs/gnu16/mvapich2/netcdf-fortran/4.6.4/lib:1;/opt/ohpc/pub/libs/gnu16/mvapich2/netcdf-cxx/4.3.1/lib:1;/opt/ohpc/pub/libs/gnu16/mvapich2/netcdf/4.10.1/lib:1;/opt/ohpc/pub/libs/gnu16/mvapich2/phdf5/2.2.0/lib:1;/opt/ohpc/pub/mpi/mvapich2-gnu16/4.1/lib:1;/opt/ohpc/pub/compiler/gcc/16.2.0/lib64:1
BATS_JUNIT_GROUP=UserLevelTests
BATS_LIB_PATH=/usr/lib/bats
PARALLEL_JOBSLOT=1
BATS_LIBEXEC=/usr/libexec/bats-core
BATS_SUITE_TEST_NUMBER=7
BATS_ROOT=/usr
DELIMITER=gnu16/mvapich2
OLDPWD=/home/ohpc-test/tests/libs/netcdf/tests
VERBOSE=1
BATS_SAVED_PATH=/opt/ohpc/pub/libs/gnu16/mvapich2/netcdf-fortran/4.6.4/bin:/opt/ohpc/pub/libs/gnu16/mvapich2/netcdf-cxx/4.3.1/bin:/opt/ohpc/pub/libs/gnu16/mvapich2/netcdf/4.10.1/bin:/opt/ohpc/pub/libs/gnu16/mvapich2/phdf5/2.2.0/bin:/opt/ohpc/pub/mpi/mvapich2-gnu16/4.1/bin:/opt/ohpc/pub/compiler/gcc/16.2.0/bin:/opt/ohpc/pub/utils/prun/3:/home/ohpc-test/.local/bin:/home/ohpc-test/bin:/opt/xcat/bin:/opt/xcat/sbin:/opt/xcat/share/xcat/tools:/sbin:/bin:/usr/sbin:/usr/bin:/usr/local/sbin
BASH_FUNC_ml%%=() { eval "$($LMOD_DIR/ml_cmd "$@")"
}
BASH_FUNC_bats_semaphore_acquire_while_locked%%=() { if [[ $(bats_semaphore_get_free_slot_count) -gt 0 ]]; then
local slot=0;
while [[ -e "$BATS_SEMAPHORE_DIR/slot-$slot" ]]; do
((++slot));
done;
if [[ $slot -lt $BATS_SEMAPHORE_NUMBER_OF_SLOTS ]]; then
touch "$BATS_SEMAPHORE_DIR/slot-$slot" && printf "%d\n" "$slot" && return 0;
fi;
fi;
return 1
}
BASH_FUNC_bats_readlinkf%%=() { readlink -f "$1"
}
BASH_FUNC_clearLmod%%=() { module --force purge;
eval $($LMOD_DIR/clearLMOD_cmd --shell bash --full "$@")
}
BASH_FUNC_bats_semaphore_get_free_slot_count%%=() { until used_slots=$(find "$BATS_SEMAPHORE_DIR" -name 'slot-*' 2> /dev/null | wc -l); do
:;
done;
echo $((BATS_SEMAPHORE_NUMBER_OF_SLOTS - used_slots))
}
BASH_FUNC_module%%=() { if [ -z "${LMOD_SH_DBG_ON+x}" ]; then
case "$-" in
*v*x*)
__lmod_sh_dbg='vx'
;;
*v*)
__lmod_sh_dbg='v'
;;
*x*)
__lmod_sh_dbg='x'
;;
esac;
fi;
if [ -n "${__lmod_sh_dbg:-}" ]; then
set +$__lmod_sh_dbg;
echo "Shell debugging temporarily silenced: export LMOD_SH_DBG_ON=1 for Lmod's output" 1>&2;
fi;
__lmod_internal_module_cmd "$@";
__lmod_my_status=$?;
if [ -n "${__lmod_sh_dbg:-}" ]; then
echo "Shell debugging restarted" 1>&2;
set -$__lmod_sh_dbg;
fi;
unset __lmod_sh_dbg;
return $__lmod_my_status
}
BASH_FUNC___lmod_internal_module_cmd%%=() { eval "$(__LMOD_PROTECTED_LD_LIBRARY_PATH=${LD_LIBRARY_PATH:-} __LMOD_PROTECTED_LD_PRELOAD=${LD_PRELOAD:-} LD_LIBRARY_PATH= LD_PRELOAD= $LMOD_CMD bash --protected_vars "$@")" && eval $(LD_LIBRARY_PATH= LD_PRELOAD= ${LMOD_SETTARG_CMD:-:} -s sh)
}
BASH_FUNC_clearMT%%=() { eval $($LMOD_DIR/clearLMOD_cmd --shell bash --simple)
}
_=/bin/printenv
-- command failed --
status : 239
output (5 lines):
srun: job 268 queued and waiting for resources
srun: job 268 has been allocated resources
srun: error: Task launch for StepId=268.0 failed on node c1: Protocol authentication error
srun: error: Application launch failed: Protocol authentication error
srun: Job step aborted
--
| Test case: | [libs/NetCDF] C++ write/read (slurm/gnu16/mvapich2) |
|---|---|
| Outcome: | Failed |
| Duration: | 0.294 sec |
| Failed |
(from function `assert_success' in file ./common/test_helper_functions.bash, line 58, in test file test_netcdf, line 174) `assert_success' failed -- command failed -- status : 239 output (5 lines): srun: job 267 queued and waiting for resources srun: job 267 has been allocated resources srun: error: Task launch for StepId=267.0 failed on node c2: Protocol authentication error srun: error: Application launch failed: Protocol authentication error srun: Job step aborted --
| Duration | 0.423 sec |
|---|---|
| Tests | 9 |
| Failures | 0 |
| Test case: | [libs/NetCDF] Verify NETCDF module is loaded and matches rpm version (gnu16/openmpi5) |
|---|---|
| Outcome: | Passed |
| Duration: | 0.225 sec |
| Test case: | [libs/NetCDF] Verify module NETCDF_DIR is defined and exists (gnu16/openmpi5) |
|---|---|
| Outcome: | Passed |
| Duration: | 0.021 sec |
| Test case: | [libs/NetCDF] Verify module NETCDF_BIN is defined and exists (gnu16/openmpi5) |
|---|---|
| Outcome: | Passed |
| Duration: | 0.022 sec |
| Test case: | [libs/NetCDF] Verify availability of nc-config binary (gnu16/openmpi5) |
|---|---|
| Outcome: | Passed |
| Duration: | 0.05 sec |
| Test case: | [libs/NetCDF] Verify module NETCDF_LIB is defined and exists (gnu16/openmpi5) |
|---|---|
| Outcome: | Passed |
| Duration: | 0.021 sec |
| Test case: | [libs/NetCDF] Verify dynamic library available in NETCDF_LIB (gnu16/openmpi5) |
|---|---|
| Outcome: | Passed |
| Duration: | 0.02 sec |
| Test case: | [libs/NetCDF] Verify static library is not present in NETCDF_LIB (gnu16/openmpi5) |
|---|---|
| Outcome: | Passed |
| Duration: | 0.02 sec |
| Duration | 0.441 sec |
|---|---|
| Tests | 9 |
| Failures | 0 |
| Test case: | [libs/NetCDF-CXX] Verify NETCDF_CXX module is loaded and matches rpm version (gnu16/openmpi5) |
|---|---|
| Outcome: | Passed |
| Duration: | 0.246 sec |
| Test case: | [libs/NetCDF-CXX] Verify module NETCDF_CXX_DIR is defined and exists (gnu16/openmpi5) |
|---|---|
| Outcome: | Passed |
| Duration: | 0.021 sec |
| Test case: | [libs/NetCDF-CXX] Verify module NETCDF_CXX_BIN is defined and exists (gnu16/openmpi5) |
|---|---|
| Outcome: | Passed |
| Duration: | 0.021 sec |
| Test case: | [libs/NetCDF-CXX] Verify availability of ncxx4-config binary (gnu16/openmpi5) |
|---|---|
| Outcome: | Passed |
| Duration: | 0.048 sec |
| Test case: | [libs/NetCDF-CXX] Verify module NETCDF_CXX_LIB is defined and exists (gnu16/openmpi5) |
|---|---|
| Outcome: | Passed |
| Duration: | 0.021 sec |
| Test case: | [libs/NetCDF-CXX] Verify dynamic library available in NETCDF_CXX_LIB (gnu16/openmpi5) |
|---|---|
| Outcome: | Passed |
| Duration: | 0.022 sec |
| Test case: | [libs/NetCDF-CXX] Verify static library is not present in NETCDF_CXX_LIB (gnu16/openmpi5) |
|---|---|
| Outcome: | Passed |
| Duration: | 0.021 sec |
| Duration | 0.421 sec |
|---|---|
| Tests | 9 |
| Failures | 0 |
| Test case: | [libs/NetCDF-Fortran] Verify NETCDF_FORTRAN module is loaded and matches rpm version (gnu16/openmpi5) |
|---|---|
| Outcome: | Passed |
| Duration: | 0.229 sec |
| Test case: | [libs/NetCDF-Fortran] Verify module NETCDF_FORTRAN_DIR is defined and exists (gnu16/openmpi5) |
|---|---|
| Outcome: | Passed |
| Duration: | 0.022 sec |
| Test case: | [libs/NetCDF-Fortran] Verify module NETCDF_FORTRAN_BIN is defined and exists (gnu16/openmpi5) |
|---|---|
| Outcome: | Passed |
| Duration: | 0.02 sec |
| Test case: | [libs/NetCDF-Fortran] Verify availability of nf-config binary (gnu16/openmpi5) |
|---|---|
| Outcome: | Passed |
| Duration: | 0.047 sec |
| Test case: | [libs/NetCDF-Fortran] Verify module NETCDF_FORTRAN_LIB is defined and exists (gnu16/openmpi5) |
|---|---|
| Outcome: | Passed |
| Duration: | 0.021 sec |
| Test case: | [libs/NetCDF-Fortran] Verify dynamic library available in NETCDF_FORTRAN_LIB (gnu16/openmpi5) |
|---|---|
| Outcome: | Passed |
| Duration: | 0.02 sec |
| Test case: | [libs/NetCDF-Fortran] Verify static library is not present in NETCDF_FORTRAN_LIB (gnu16/openmpi5) |
|---|---|
| Outcome: | Passed |
| Duration: | 0.02 sec |
| Duration | 4.267 sec |
|---|---|
| Tests | 8 |
| Failures | 3 |
| Test case: | [libs/NetCDF] verify nc4/hdf5 available for C interface (gnu16/openmpi5) |
|---|---|
| Outcome: | Passed |
| Duration: | 0.086 sec |
| Test case: | [libs/NetCDF] verify nc4 available for Fortran interface (gnu16/openmpi5) |
|---|---|
| Outcome: | Passed |
| Duration: | 0.062 sec |
| Test case: | [libs/NetCDF] verify nc4 available for C++ interface (gnu16/openmpi5) |
|---|---|
| Outcome: | Skipped |
| Duration: | 0.0 sec |
| Skipped |
option no longer supported
| Test case: | [libs/NetCDF] C write/read (slurm/gnu16/openmpi5) |
|---|---|
| Outcome: | Failed |
| Duration: | 0.967 sec |
| Failed |
(from function `assert_success' in file ./common/test_helper_functions.bash, line 58, in test file test_netcdf, line 95) `assert_success' failed total 1460 drwxr-xr-x. 7 ohpc-test ohpc-test 4096 Oct 9 18:29 . drwxr-xr-x. 7 ohpc-test ohpc-test 4096 Oct 9 18:29 .. -rw-r--r--. 1 ohpc-test ohpc-test 5365 Oct 9 08:10 add.c -rw-r--r--. 1 ohpc-test ohpc-test 1327 Oct 9 08:10 add.h -rw-r--r--. 1 ohpc-test ohpc-test 6352 Oct 9 18:29 add.o -rw-r--r--. 1 ohpc-test ohpc-test 50042 Oct 9 08:10 atttests.c -rw-r--r--. 1 ohpc-test ohpc-test 66560 Oct 9 18:29 atttests.o -rw-r--r--. 1 ohpc-test ohpc-test 24221 Oct 9 08:10 cdftests.c -rw-r--r--. 1 ohpc-test ohpc-test 30904 Oct 9 18:29 cdftests.o lrwxrwxrwx. 1 ohpc-test ohpc-test 16 Oct 9 08:10 common -> ../../../common/ -rw-r--r--. 1 ohpc-test ohpc-test 20 Oct 9 08:10 config.h -rw-r--r--. 1 ohpc-test ohpc-test 2072 Oct 9 08:10 COPYRIGHT -rwxr-xr-x. 1 ohpc-test ohpc-test 16768 Oct 9 18:29 C_read -rw-r--r--. 1 ohpc-test ohpc-test 1942 Oct 9 08:10 C_simple_rd.c -rw-r--r--. 1 ohpc-test ohpc-test 2704 Oct 9 18:29 C_simple_rd.o -rw-r--r--. 1 ohpc-test ohpc-test 2657 Oct 9 08:10 C_simple_wr.c -rw-r--r--. 1 ohpc-test ohpc-test 3696 Oct 9 18:29 C_simple_wr.o -rwxr-xr-x. 1 ohpc-test ohpc-test 16960 Oct 9 18:29 C_write -rwxr-xr-x. 1 ohpc-test ohpc-test 26240 Oct 9 18:29 CXX_read -rwxr-xr-x. 1 ohpc-test ohpc-test 38696 Oct 9 18:29 CXX_write drwxr-xr-x. 2 ohpc-test ohpc-test 4096 Oct 9 18:29 .deps -rw-r--r--. 1 ohpc-test ohpc-test 13880 Oct 9 08:10 dimtests.c -rw-r--r--. 1 ohpc-test ohpc-test 18328 Oct 9 18:29 dimtests.o -rw-r--r--. 1 ohpc-test ohpc-test 3879 Oct 9 08:10 driver.c -rw-r--r--. 1 ohpc-test ohpc-test 6352 Oct 9 18:29 driver.o -rw-r--r--. 1 ohpc-test ohpc-test 1082 Oct 9 08:10 emalloc.c -rw-r--r--. 1 ohpc-test ohpc-test 683 Oct 9 08:10 emalloc.h -rw-r--r--. 1 ohpc-test ohpc-test 2176 Oct 9 18:29 emalloc.o -rw-r--r--. 1 ohpc-test ohpc-test 1509 Oct 9 08:10 error.c -rw-r--r--. 1 ohpc-test ohpc-test 920 Oct 9 08:10 error.h -rw-r--r--. 1 ohpc-test ohpc-test 2480 Oct 9 18:29 error.o -rwxr-xr-x. 1 ohpc-test ohpc-test 17648 Oct 9 18:29 F90_read -rwxr-xr-x. 1 ohpc-test ohpc-test 17496 Oct 9 18:29 F90_write drwxr-xr-x. 2 ohpc-test ohpc-test 132 Oct 9 18:28 family-gnu16 drwxr-xr-x. 2 ohpc-test ohpc-test 4096 Oct 9 18:28 family-gnu16-mpich drwxr-xr-x. 2 ohpc-test ohpc-test 4096 Oct 9 18:28 family-gnu16-mvapich2 drwxr-xr-x. 2 ohpc-test ohpc-test 132 Oct 9 18:27 family-gnu16-openmpi5 -rw-r--r--. 1 ohpc-test ohpc-test 39491 Oct 9 18:29 Makefile -rw-r--r--. 1 ohpc-test ohpc-test 1100 Oct 9 08:10 Makefile.am -rw-r--r--. 1 ohpc-test ohpc-test 40620 Oct 9 18:28 Makefile.in -rw-r--r--. 1 ohpc-test ohpc-test 1633 Oct 9 08:10 misctest.c -rw-r--r--. 1 ohpc-test ohpc-test 3048 Oct 9 18:29 misctest.o -rwxr-xr-x. 1 ohpc-test ohpc-test 122952 Oct 9 18:29 nctest -rw-r--r--. 1 ohpc-test ohpc-test 43696 Oct 9 18:28 nctest_64bit_offset.nc -rw-r--r--. 1 ohpc-test ohpc-test 43584 Oct 9 18:28 nctest_classic.nc -rw-r--r--. 1 ohpc-test ohpc-test 136067 Oct 9 18:28 nctest_netcdf4.nc -rw-r--r--. 1 ohpc-test ohpc-test 16086 Oct 9 08:10 rec.c -rw-r--r--. 1 ohpc-test ohpc-test 15696 Oct 9 18:29 rec.o -rw-r--r--. 1 ohpc-test ohpc-test 43696 Oct 9 08:10 ref_nctest_64bit_offset.nc -rw-r--r--. 1 ohpc-test ohpc-test 43584 Oct 9 08:10 ref_nctest_classic.nc -rw-r--r--. 1 ohpc-test ohpc-test 8843 Oct 9 18:28 simple_xy_nc4_f.nc -rw-r--r--. 1 ohpc-test ohpc-test 17173 Oct 9 08:10 simple_xy_nc4.nc.ref -rw-r--r--. 1 ohpc-test ohpc-test 3146 Oct 9 08:10 simple_xy_nc4_rd.f90 -rw-r--r--. 1 ohpc-test ohpc-test 5584 Oct 9 18:29 simple_xy_nc4_rd.o -rw-r--r--. 1 ohpc-test ohpc-test 3307 Oct 9 08:10 simple_xy_nc4_wr.f90 -rw-r--r--. 1 ohpc-test ohpc-test 5088 Oct 9 18:29 simple_xy_nc4_wr.o -rw-r--r--. 1 ohpc-test ohpc-test 1587 Oct 9 08:10 simple_xy_rd.cpp -rw-r--r--. 1 ohpc-test ohpc-test 24512 Oct 9 18:29 simple_xy_rd.o -rw-r--r--. 1 ohpc-test ohpc-test 2477 Oct 9 08:10 simple_xy_wr.cpp -rw-r--r--. 1 ohpc-test ohpc-test 49504 Oct 9 18:29 simple_xy_wr.o -rw-r--r--. 1 ohpc-test ohpc-test 10126 Oct 9 08:10 slabs.c -rw-r--r--. 1 ohpc-test ohpc-test 9944 Oct 9 18:29 slabs.o -rw-r--r--. 1 ohpc-test ohpc-test 32 Oct 9 18:28 temp.tmp -rw-r--r--. 1 ohpc-test ohpc-test 8192 Oct 9 18:28 test2.nc -rw-r--r--. 1 ohpc-test ohpc-test 1605 Oct 9 08:10 testcdf.h -rwxr-xr-x. 1 ohpc-test ohpc-test 3289 Oct 9 08:10 test_C_module -rw-r--r--. 1 ohpc-test ohpc-test 890 Oct 9 18:29 test_C_module.log -rw-r--r--. 1 ohpc-test ohpc-test 1515 Oct 9 18:29 test_C_module.log.xml -rw-r--r--. 1 ohpc-test ohpc-test 82 Oct 9 18:29 test_C_module.trs -rwxr-xr-x. 1 ohpc-test ohpc-test 3267 Oct 9 08:10 test_CXX_module -rw-r--r--. 1 ohpc-test ohpc-test 963 Oct 9 18:29 test_CXX_module.log -rw-r--r--. 1 ohpc-test ohpc-test 1606 Oct 9 18:29 test_CXX_module.log.xml -rw-r--r--. 1 ohpc-test ohpc-test 82 Oct 9 18:29 test_CXX_module.trs -rwxr-xr-x. 1 ohpc-test ohpc-test 3270 Oct 9 08:10 test_Fortran_module -rw-r--r--. 1 ohpc-test ohpc-test 1032 Oct 9 18:29 test_Fortran_module.log -rw-r--r--. 1 ohpc-test ohpc-test 1711 Oct 9 18:29 test_Fortran_module.log.xml -rw-r--r--. 1 ohpc-test ohpc-test 82 Oct 9 18:29 test_Fortran_module.trs -rwxr-xr-x. 1 ohpc-test ohpc-test 3865 Oct 9 08:10 test_netcdf -rw-r--r--. 1 ohpc-test ohpc-test 5 Oct 9 18:29 test_netcdf.log -rw-r--r--. 1 ohpc-test ohpc-test 0 Oct 9 18:29 test_netcdf.log.xml -rw-r--r--. 1 ohpc-test ohpc-test 1863 Oct 9 08:10 tests.h -rw-r--r--. 1 ohpc-test ohpc-test 5527 Oct 9 08:10 val.c -rw-r--r--. 1 ohpc-test ohpc-test 1055 Oct 9 08:10 val.h -rw-r--r--. 1 ohpc-test ohpc-test 5320 Oct 9 18:29 val.o -rw-r--r--. 1 ohpc-test ohpc-test 10076 Oct 9 08:10 vardef.c -rw-r--r--. 1 ohpc-test ohpc-test 13472 Oct 9 18:29 vardef.o -rw-r--r--. 1 ohpc-test ohpc-test 4511 Oct 9 08:10 varget.c -rw-r--r--. 1 ohpc-test ohpc-test 4555 Oct 9 08:10 vargetg.c -rw-r--r--. 1 ohpc-test ohpc-test 6096 Oct 9 18:29 vargetg.o -rw-r--r--. 1 ohpc-test ohpc-test 5768 Oct 9 18:29 varget.o -rw-r--r--. 1 ohpc-test ohpc-test 4719 Oct 9 08:10 varput.c -rw-r--r--. 1 ohpc-test ohpc-test 4707 Oct 9 08:10 varputg.c -rw-r--r--. 1 ohpc-test ohpc-test 6208 Oct 9 18:29 varputg.o -rw-r--r--. 1 ohpc-test ohpc-test 5952 Oct 9 18:29 varput.o -rw-r--r--. 1 ohpc-test ohpc-test 21492 Oct 9 08:10 vartests.c -rw-r--r--. 1 ohpc-test ohpc-test 25448 Oct 9 18:29 vartests.o -rw-r--r--. 1 ohpc-test ohpc-test 4450 Oct 9 08:10 vputget.c -rw-r--r--. 1 ohpc-test ohpc-test 6788 Oct 9 08:10 vputgetg.c -rw-r--r--. 1 ohpc-test ohpc-test 8656 Oct 9 18:29 vputgetg.o -rw-r--r--. 1 ohpc-test ohpc-test 5360 Oct 9 18:29 vputget.o -- command failed -- status : 239 output (5 lines): srun: job 272 queued and waiting for resources srun: job 272 has been allocated resources srun: error: Task launch for StepId=272.0 failed on node c1: Protocol authentication error srun: error: Application launch failed: Protocol authentication error srun: Job step aborted --
| Test case: | [libs/NetCDF] Fortran write/read (slurm/gnu16/openmpi5) |
|---|---|
| Outcome: | Failed |
| Duration: | 1.015 sec |
| Failed |
(from function `assert_success' in file ./common/test_helper_functions.bash, line 58,
in test file test_netcdf, line 140)
`assert_success' failed
SHELL=/bin/bash
BATS_RUN_LOGS_DIRECTORY=
TEST_DATA=/tmp/tmp.wUbDDCNEsA
BATS_TEST_TMPDIR=/tmp/bats-run-0JPqUF/test/7
NETCDF_CXX_LIB=/opt/ohpc/pub/libs/gnu16/openmpi5/netcdf-cxx/4.3.1/lib
SUDO_GID=0
HISTCONTROL=ignoredups
OMPI_MCA_rmaps_base_oversubscribe=1
UCX_INC=/opt/ohpc/pub/mpi/ucx-ohpc/1.22.0/include
PARALLEL_JOBSLOT0=0
PKG_CONFIG_PATH=/opt/ohpc/pub/mpi/ucx-ohpc/1.22.0/lib/pkgconfig:/opt/ohpc/pub/mpi/openmpi5-gnu16/5.0.11/lib/pkgconfig
HOSTNAME=ohpc-lenovo-sms
HISTSIZE=1048576
FPATH=/opt/ohpc/admin/lmod/lmod/init/ksh_funcs
BATS_LIBDIR=lib
BATS_SUITE_TMPDIR=/tmp/bats-run-0JPqUF/suite
BATS_ROOT_PID=341029
BATS_WARNING_FILE=/tmp/bats-run-0JPqUF/warnings.log
BATS_FILE_TMPDIR=/tmp/bats-run-0JPqUF/file/0
_ModuleTable007_=MSwKc3RhdHVzID0gImFjdGl2ZSIsCnVzZXJOYW1lID0gInBoZGY1IiwKd1YgPSAiMDAwMDAwMDAyLjAwMDAwMDAwMi4qemZpbmFsIiwKfSwKcHJ1biA9IHsKZm4gPSAiL29wdC9vaHBjL3B1Yi9tb2R1bGVmaWxlcy9wcnVuLzMiLApmdWxsTmFtZSA9ICJwcnVuLzMiLApsb2FkT3JkZXIgPSAxLApwcm9wVCA9IHt9LApzdGFja0RlcHRoID0gMCwKc3RhdHVzID0gImFjdGl2ZSIsCnVzZXJOYW1lID0gInBydW4iLAp3ViA9ICIwMDAwMDAwMDMuKnpmaW5hbCIsCn0sCnVjeCA9IHsKZm4gPSAiL29wdC9vaHBjL3B1Yi9tb2R1bGVmaWxlcy91Y3gvMS4yMi4wIiwKZnVsbE5hbWUgPSAidWN4LzEuMjIuMCIsCmxvYWRPcmRlciA9IDQsCnByb3BUID0ge30sCnJlZl9jb3VudCA9IDEsCnN0
_ModuleTable002_=dGl2ZSIsCnVzZXJOYW1lID0gImdudTE2IiwKd1YgPSAiMDAwMDAwMDE2LjAwMDAwMDAwMi4qemZpbmFsIiwKfSwKaHdsb2MgPSB7CmZuID0gIi9vcHQvb2hwYy9wdWIvbW9kdWxlZmlsZXMvaHdsb2MvMi4xNS4wIiwKZnVsbE5hbWUgPSAiaHdsb2MvMi4xNS4wIiwKbG9hZE9yZGVyID0gMywKcHJvcFQgPSB7fSwKcmVmX2NvdW50ID0gMSwKc3RhY2tEZXB0aCA9IDEsCnN0YXR1cyA9ICJhY3RpdmUiLAp1c2VyTmFtZSA9ICJod2xvYyIsCndWID0gIjAwMDAwMDAwMi4wMDAwMDAwMTUuKnpmaW5hbCIsCn0sCm5ldGNkZiA9IHsKZGVwVCA9IHsKZGVwQSA9IHsKewpzbiA9ICJwaGRmNSIsCnZlcnNpb24gPSB7CmtpbmQgPSAiYm9vbCIsCnZhbHVlID0gdHJ1ZSwKfSwKfSwKfSwKfSwK
HDF5_DIR=/opt/ohpc/pub/libs/gnu16/openmpi5/phdf5/2.2.0
BATS_SEMAPHORE_DIR=/tmp/bats-run-0JPqUF/semaphores
__LMOD_REF_COUNT_MODULEPATH=/opt/ohpc/pub/moduledeps/gnu16-openmpi5:1;/opt/ohpc/pub/moduledeps/gnu16:1;/opt/ohpc/pub/modulefiles:1
CXX_DATA=/tmp/tmp.9mrJHG8gg3
_ModuleTable005_=NC42LjQiLApsb2FkT3JkZXIgPSA5LApwcm9wVCA9IHt9LApzdGFja0RlcHRoID0gMCwKc3RhdHVzID0gImFjdGl2ZSIsCnVzZXJOYW1lID0gIm5ldGNkZi1mb3J0cmFuIiwKd1YgPSAiMDAwMDAwMDA0LjAwMDAwMDAwNi4wMDAwMDAwMDQuKnpmaW5hbCIsCn0sCm9wZW5tcGk1ID0gewphY3Rpb25BID0gewpbW3ByZXBlbmRfcGF0aCgiTU9EVUxFUEFUSCIsIi9vcHQvb2hwYy9wdWIvbW9kdWxlZGVwcy9nbnUxNi1vcGVubXBpNSIpXV0sCn0sCmRlcFQgPSB7CmRlcEEgPSB7CnsKc24gPSAiaHdsb2MiLAp2ZXJzaW9uID0gewpraW5kID0gImJvb2wiLAp2YWx1ZSA9IHRydWUsCn0sCn0sCnsKc24gPSAidWN4IiwKdmVyc2lvbiA9IHsKa2luZCA9ICJib29sIiwKdmFsdWUgPSB0cnVl
TEST_LOGS=test_C_module.log test_CXX_module.log test_Fortran_module.log test_netcdf.log
LMOD_FAMILY_HDF5_VERSION=2.2.0
SSHPASS=
NETCDF_CXX_BIN=/opt/ohpc/pub/libs/gnu16/openmpi5/netcdf-cxx/4.3.1/bin
BATS_END_CODE_QUOTE='
SUDO_COMMAND=/bin/bash -c /tmp/user_integration_tests
SUDO_USER=root
BATS_TEST_SOURCE=/home/ohpc-test/tests/libs/netcdf/tests/test_netcdf
BATS_TEST_NAME=test_-5b-24-7bTESTNAME-7d-5d_Fortran_write-2fread_-28-24RESOURCE-5fMANAGER-2f-24-7bDELIMITER-7d-29
GPG_TTY=not a tty
LMOD_DIR=/opt/ohpc/admin/lmod/lmod/libexec
OHPC_MPI_LAUNCHERS=pmix
PWD=/home/ohpc-test/tests/libs/netcdf/tests
LOGNAME=ohpc-test
HWLOC_INC=/opt/ohpc/pub/libs/hwloc/include
MODULESHOME=/opt/ohpc/admin/lmod/lmod
PARALLEL_TMP=/tmp/parNHV9t
MANPATH=/opt/ohpc/pub/libs/gnu16/openmpi5/netcdf-fortran/4.6.4/share/man:/opt/ohpc/pub/libs/gnu16/openmpi5/netcdf-cxx/4.3.1/share/man:/opt/ohpc/pub/libs/gnu16/openmpi5/netcdf/4.10.1/share/man:/opt/ohpc/pub/libs/hwloc/man:/opt/ohpc/pub/mpi/openmpi5-gnu16/5.0.11/share/man:/opt/ohpc/pub/compiler/gcc/16.2.0/share/man:/opt/xcat/share/man:/opt/ohpc/admin/lmod/lmod/share/man::
NETCDF_FORTRAN_DIR=/opt/ohpc/pub/libs/gnu16/openmpi5/netcdf-fortran/4.6.4
BATS_JUNIT_FORMAT=1
CI_CLUSTER=lenovo
LMOD_PREPEND_BLOCK=normal
SUDO_HOME=/root
_ModuleTable008_=YWNrRGVwdGggPSAxLApzdGF0dXMgPSAiYWN0aXZlIiwKdXNlck5hbWUgPSAidWN4IiwKd1YgPSAiMDAwMDAwMDAxLjAwMDAwMDAyMi4qemZpbmFsIiwKfSwKfSwKbXBhdGhBID0gewoiL29wdC9vaHBjL3B1Yi9tb2R1bGVkZXBzL2dudTE2LW9wZW5tcGk1IiwgIi9vcHQvb2hwYy9wdWIvbW9kdWxlZGVwcy9nbnUxNiIsICIvb3B0L29ocGMvcHViL21vZHVsZWZpbGVzIiwKfSwKc3lzdGVtQmFzZU1QQVRIID0gIi9vcHQvb2hwYy9wdWIvbW9kdWxlZmlsZXMiLAp9Cg==
BATS_TMPDIR=/tmp
__LMOD_REF_COUNT_INCLUDE=/opt/ohpc/pub/libs/gnu16/openmpi5/netcdf-fortran/4.6.4/include:1;/opt/ohpc/pub/libs/gnu16/openmpi5/netcdf-cxx/4.3.1/include:1;/opt/ohpc/pub/libs/gnu16/openmpi5/netcdf/4.10.1/include:1;/opt/ohpc/pub/libs/gnu16/openmpi5/phdf5/2.2.0/include:1;/opt/ohpc/pub/compiler/gcc/16.2.0/include:1
BATS_USE_MKTEMP=1
BATS_TEST_DESCRIPTION=[libs/NetCDF] Fortran write/read (slurm/gnu16/openmpi5)
UCX_LIB=/opt/ohpc/pub/mpi/ucx-ohpc/1.22.0/lib
NETCDF_FORTRAN_INC=/opt/ohpc/pub/libs/gnu16/openmpi5/netcdf-fortran/4.6.4/include
__LMOD_REF_COUNT_PATH=/opt/ohpc/pub/libs/gnu16/openmpi5/netcdf-fortran/4.6.4/bin:1;/opt/ohpc/pub/libs/gnu16/openmpi5/netcdf-cxx/4.3.1/bin:1;/opt/ohpc/pub/libs/gnu16/openmpi5/netcdf/4.10.1/bin:1;/opt/ohpc/pub/libs/gnu16/openmpi5/phdf5/2.2.0/bin:1;/opt/ohpc/pub/mpi/ucx-ohpc/1.22.0/bin:1;/opt/ohpc/pub/libs/hwloc/bin:1;/opt/ohpc/pub/mpi/openmpi5-gnu16/5.0.11/bin:1;/opt/ohpc/pub/compiler/gcc/16.2.0/bin:1;/opt/ohpc/pub/utils/prun/3:1;/home/ohpc-test/.local/bin:1;/home/ohpc-test/bin:1;/opt/xcat/bin:1;/opt/xcat/sbin:1;/opt/xcat/share/xcat/tools:1;/sbin:1;/bin:1;/usr/sbin:1;/usr/bin:1;/usr/local/sbin:1
HOME=/home/ohpc-test
FI_PROVIDER=sockets
PARALLEL_RSYNC_OPTS=-rlDzR
_ModuleTable_Sz_=8
LANG=en_US.UTF-8
BATS_TEST_FILENAME=/home/ohpc-test/tests/libs/netcdf/tests/test_netcdf
__LMOD_REF_COUNT_PKG_CONFIG_PATH=/opt/ohpc/pub/mpi/ucx-ohpc/1.22.0/lib/pkgconfig:1;/opt/ohpc/pub/mpi/openmpi5-gnu16/5.0.11/lib/pkgconfig:1
srcdir=.
NETCDF_FORTRAN_LIB=/opt/ohpc/pub/libs/gnu16/openmpi5/netcdf-fortran/4.6.4/lib
PARALLEL_PID=341090
BATS_RUN_TMPDIR=/tmp/bats-run-0JPqUF
LMOD_SETTARG_FULL_SUPPORT=no
BATS_JUNIT_CLASS=NetCDF
HDF5_INC=/opt/ohpc/pub/libs/gnu16/openmpi5/phdf5/2.2.0/include
BATS_VERSION=1.11.1
TMPDIR=/tmp
F_DATA=/tmp/tmp.2BwpYWip4e
https_proxy=http://10.241.58.130:3128
NETCDF_INC=/opt/ohpc/pub/libs/gnu16/openmpi5/netcdf/4.10.1/include
PERL5LIB=/usr/local/share/perl5:
NETCDF_DIR=/opt/ohpc/pub/libs/gnu16/openmpi5/netcdf/4.10.1
XCATROOT=/opt/xcat
LMOD_VERSION=9.4.2
BATS_GUARANTEED_MINIMUM_VERSION=0.0.0
HDF5_BIN=/opt/ohpc/pub/libs/gnu16/openmpi5/phdf5/2.2.0/bin
TESTNAME=libs/NetCDF
SINGULARITY_TMPDIR=/var/tmp
MFLAGS=-k --no-print-directory
_ModuleTable003_=Zm4gPSAiL29wdC9vaHBjL3B1Yi9tb2R1bGVkZXBzL2dudTE2LW9wZW5tcGk1L25ldGNkZi80LjEwLjEiLApmdWxsTmFtZSA9ICJuZXRjZGYvNC4xMC4xIiwKbG9hZE9yZGVyID0gNywKcHJvcFQgPSB7fSwKc3RhY2tEZXB0aCA9IDAsCnN0YXR1cyA9ICJhY3RpdmUiLAp1c2VyTmFtZSA9ICJuZXRjZGYiLAp3ViA9ICIwMDAwMDAwMDQuMDAwMDAwMDEwLjAwMDAwMDAwMS4qemZpbmFsIiwKfSwKWyJuZXRjZGYtY3h4Il0gPSB7CmRlcFQgPSB7CmRlcEEgPSB7CnsKc24gPSAibmV0Y2RmIiwKdmVyc2lvbiA9IHsKa2luZCA9ICJib29sIiwKdmFsdWUgPSB0cnVlLAp9LAp9LAp9LAp9LApmbiA9ICIvb3B0L29ocGMvcHViL21vZHVsZWRlcHMvZ251MTYtb3Blbm1waTUvbmV0Y2RmLWN4
PARALLEL_SEQ=1
AUTOMAKE_JUNIT_FILE=1
BATS_CWD=/home/ohpc-test/tests/libs/netcdf/tests
MAKEFLAGS=k --no-print-directory -- TEST_LOGS=test_C_module.log\ test_CXX_module.log\ test_Fortran_module.log\ test_netcdf.log
LMOD_PKG=/opt/ohpc/admin/lmod/lmod
TERM=unknown
BATS_LINE_REFERENCE_FORMAT=comma_line
NETCDF_FORTRAN_BIN=/opt/ohpc/pub/libs/gnu16/openmpi5/netcdf-fortran/4.6.4/bin
BATS_SEMAPHORE_NUMBER_OF_SLOTS=8
C_DATA=/tmp/tmp.6AqZQxvJqZ
LESSOPEN=||/usr/bin/lesspipe.sh %s
NETCDF_CXX_INC=/opt/ohpc/pub/libs/gnu16/openmpi5/netcdf-cxx/4.3.1/include
PARALLEL_SSHLOGIN=:
USER=ohpc-test
PARALLEL_ENABLED=yes
BATS_BEGIN_CODE_QUOTE=`
HDF5_LIB=/opt/ohpc/pub/libs/gnu16/openmpi5/phdf5/2.2.0/lib
LOADEDMODULES=prun/3:gnu16/16.2.0:hwloc/2.15.0:ucx/1.22.0:openmpi5/5.0.11:phdf5/2.2.0:netcdf/4.10.1:netcdf-cxx/4.3.1:netcdf-fortran/4.6.4
HWLOC_DIR=/opt/ohpc/pub/libs/hwloc
BATS_TEMPDIR_CLEANUP=1
INCLUDE=/opt/ohpc/pub/libs/gnu16/openmpi5/netcdf-fortran/4.6.4/include:/opt/ohpc/pub/libs/gnu16/openmpi5/netcdf-cxx/4.3.1/include:/opt/ohpc/pub/libs/gnu16/openmpi5/netcdf/4.10.1/include:/opt/ohpc/pub/libs/gnu16/openmpi5/phdf5/2.2.0/include:/opt/ohpc/pub/compiler/gcc/16.2.0/include
LMOD_ROOT=/opt/ohpc/admin/lmod
LMOD_SETTARG_CMD=:
SHLVL=10
BASH_ENV=/opt/ohpc/admin/lmod/lmod/init/bash
_ModuleTable006_=LAp9LAp9LAp9LAp9LApmbiA9ICIvb3B0L29ocGMvcHViL21vZHVsZWRlcHMvZ251MTYvb3Blbm1waTUvNS4wLjExIiwKZnVsbE5hbWUgPSAib3Blbm1waTUvNS4wLjExIiwKbG9hZE9yZGVyID0gNSwKcHJvcFQgPSB7fSwKc3RhY2tEZXB0aCA9IDAsCnN0YXR1cyA9ICJhY3RpdmUiLAp1c2VyTmFtZSA9ICJvcGVubXBpNSIsCndWID0gIjAwMDAwMDAwNS4wMDAwMDAwMDAuMDAwMDAwMDExLip6ZmluYWwiLAp9LApwaGRmNSA9IHsKZm4gPSAiL29wdC9vaHBjL3B1Yi9tb2R1bGVkZXBzL2dudTE2LW9wZW5tcGk1L3BoZGY1LzIuMi4wIiwKZnVsbE5hbWUgPSAicGhkZjUvMi4yLjAiLApsb2FkT3JkZXIgPSA2LApwcm9wVCA9IHt9LApyZWZfY291bnQgPSAxLApzdGFja0RlcHRoID0g
NETCDF_CXX_DIR=/opt/ohpc/pub/libs/gnu16/openmpi5/netcdf-cxx/4.3.1
BATS_REPORT_FILENAME=test_netcdf.log.xml
MAKELEVEL=8
LMOD_FULL_SETTARG_SUPPORT=no
MPI_DIR=/opt/ohpc/pub/mpi/openmpi5-gnu16/5.0.11
UCX_BIN=/opt/ohpc/pub/mpi/ucx-ohpc/1.22.0/bin
LMOD_FAMILY_HDF5=phdf5
__LMOD_REF_COUNT_MANPATH=/opt/ohpc/pub/libs/gnu16/openmpi5/netcdf-fortran/4.6.4/share/man:1;/opt/ohpc/pub/libs/gnu16/openmpi5/netcdf-cxx/4.3.1/share/man:1;/opt/ohpc/pub/libs/gnu16/openmpi5/netcdf/4.10.1/share/man:1;/opt/ohpc/pub/libs/hwloc/man:1;/opt/ohpc/pub/mpi/openmpi5-gnu16/5.0.11/share/man:1;/opt/ohpc/pub/compiler/gcc/16.2.0/share/man:1;/opt/xcat/share/man:1;/opt/ohpc/admin/lmod/lmod/share/man:1;:1
http_proxy=http://10.241.58.130:3128
PARALLEL_SSHHOST=:
HWLOC_LIB=/opt/ohpc/pub/libs/hwloc/lib
_ModuleTable001_=X01vZHVsZVRhYmxlXyA9IHsKTVR2ZXJzaW9uID0gMywKY19yZWJ1aWxkVGltZSA9IGZhbHNlLApjX3Nob3J0VGltZSA9IGZhbHNlLApkZXB0aFQgPSB7fSwKZmFtaWx5ID0gewpNUEkgPSAib3Blbm1waTUiLApjb21waWxlciA9ICJnbnUxNiIsCmhkZjUgPSAicGhkZjUiLAp9LAptVCA9IHsKZ251MTYgPSB7CmFjdGlvbkEgPSB7CltbcHJlcGVuZF9wYXRoKCJNT0RVTEVQQVRIIiwiL29wdC9vaHBjL3B1Yi9tb2R1bGVkZXBzL2dudTE2IildXSwKfSwKZm4gPSAiL29wdC9vaHBjL3B1Yi9tb2R1bGVmaWxlcy9nbnUxNi8xNi4yLjAiLApmdWxsTmFtZSA9ICJnbnUxNi8xNi4yLjAiLApsb2FkT3JkZXIgPSAyLApwcm9wVCA9IHt9LApzdGFja0RlcHRoID0gMCwKc3RhdHVzID0gImFj
LD_LIBRARY_PATH=/opt/ohpc/pub/libs/gnu16/openmpi5/netcdf-fortran/4.6.4/lib:/opt/ohpc/pub/libs/gnu16/openmpi5/netcdf-cxx/4.3.1/lib:/opt/ohpc/pub/libs/gnu16/openmpi5/netcdf/4.10.1/lib:/opt/ohpc/pub/libs/gnu16/openmpi5/phdf5/2.2.0/lib:/opt/ohpc/pub/mpi/ucx-ohpc/1.22.0/lib:/opt/ohpc/pub/libs/hwloc/lib:/opt/ohpc/pub/mpi/openmpi5-gnu16/5.0.11/lib:/opt/ohpc/pub/compiler/gcc/16.2.0/lib64
LMOD_FAMILY_COMPILER=gnu16
LMOD_COLORIZE=no
_ModuleTable004_=eC80LjMuMSIsCmZ1bGxOYW1lID0gIm5ldGNkZi1jeHgvNC4zLjEiLApsb2FkT3JkZXIgPSA4LApwcm9wVCA9IHt9LApzdGFja0RlcHRoID0gMCwKc3RhdHVzID0gImFjdGl2ZSIsCnVzZXJOYW1lID0gIm5ldGNkZi1jeHgiLAp3ViA9ICIwMDAwMDAwMDQuMDAwMDAwMDAzLjAwMDAwMDAwMS4qemZpbmFsIiwKfSwKWyJuZXRjZGYtZm9ydHJhbiJdID0gewpkZXBUID0gewpkZXBBID0gewp7CnNuID0gIm5ldGNkZiIsCnZlcnNpb24gPSB7CmtpbmQgPSAiYm9vbCIsCnZhbHVlID0gdHJ1ZSwKfSwKfSwKfSwKfSwKZm4gPSAiL29wdC9vaHBjL3B1Yi9tb2R1bGVkZXBzL2dudTE2LW9wZW5tcGk1L25ldGNkZi1mb3J0cmFuLzQuNi40IiwKZnVsbE5hbWUgPSAibmV0Y2RmLWZvcnRyYW4v
LMOD_FAMILY_MPI_VERSION=5.0.11
RESOURCE_MANAGER=slurm
BATS_TEST_RETRIES=0
OMP_NUM_THREADS=2
LMOD_FAMILY_MPI=openmpi5
DEBUGINFOD_IMA_CERT_PATH=/etc/keys/ima:
UCX_WARN_UNUSED_ENV_VARS=N
ALL_ENABLED=yes
UCX_DIR=/opt/ohpc/pub/mpi/ucx-ohpc/1.22.0
BATS_RUNLOG_FILE=/dev/null
PERL_BADLANG=0
LMOD_FAMILY_COMPILER_VERSION=16.2.0
PARALLEL_REMOTE_TMPDIR=/tmp
NETCDF_BIN=/opt/ohpc/pub/libs/gnu16/openmpi5/netcdf/4.10.1/bin
BATS_TEST_NUMBER=7
BATS_ENABLE_TIMING=-T
OMPI_MCA_mca_base_component_show_load_errors=0
PATH=/usr/libexec/bats-core:/opt/ohpc/pub/libs/gnu16/openmpi5/netcdf-fortran/4.6.4/bin:/opt/ohpc/pub/libs/gnu16/openmpi5/netcdf-cxx/4.3.1/bin:/opt/ohpc/pub/libs/gnu16/openmpi5/netcdf/4.10.1/bin:/opt/ohpc/pub/libs/gnu16/openmpi5/phdf5/2.2.0/bin:/opt/ohpc/pub/mpi/ucx-ohpc/1.22.0/bin:/opt/ohpc/pub/libs/hwloc/bin:/opt/ohpc/pub/mpi/openmpi5-gnu16/5.0.11/bin:/opt/ohpc/pub/compiler/gcc/16.2.0/bin:/opt/ohpc/pub/utils/prun/3:/home/ohpc-test/.local/bin:/home/ohpc-test/bin:/opt/xcat/bin:/opt/xcat/sbin:/opt/xcat/share/xcat/tools:/sbin:/bin:/usr/sbin:/usr/bin:/usr/local/sbin
NETCDF_LIB=/opt/ohpc/pub/libs/gnu16/openmpi5/netcdf/4.10.1/lib
HWLOC_BIN=/opt/ohpc/pub/libs/hwloc/bin
MODULEPATH=/opt/ohpc/pub/moduledeps/gnu16-openmpi5:/opt/ohpc/pub/moduledeps/gnu16:/opt/ohpc/pub/modulefiles
_LMFILES_=/opt/ohpc/pub/modulefiles/prun/3:/opt/ohpc/pub/modulefiles/gnu16/16.2.0:/opt/ohpc/pub/modulefiles/hwloc/2.15.0:/opt/ohpc/pub/modulefiles/ucx/1.22.0:/opt/ohpc/pub/moduledeps/gnu16/openmpi5/5.0.11:/opt/ohpc/pub/moduledeps/gnu16-openmpi5/phdf5/2.2.0:/opt/ohpc/pub/moduledeps/gnu16-openmpi5/netcdf/4.10.1:/opt/ohpc/pub/moduledeps/gnu16-openmpi5/netcdf-cxx/4.3.1:/opt/ohpc/pub/moduledeps/gnu16-openmpi5/netcdf-fortran/4.6.4
SUDO_UID=0
LMOD_CMD=/opt/ohpc/admin/lmod/lmod/libexec/lmod
MAIL=/var/spool/mail/ohpc-test
__LMOD_REF_COUNT_LD_LIBRARY_PATH=/opt/ohpc/pub/libs/gnu16/openmpi5/netcdf-fortran/4.6.4/lib:1;/opt/ohpc/pub/libs/gnu16/openmpi5/netcdf-cxx/4.3.1/lib:1;/opt/ohpc/pub/libs/gnu16/openmpi5/netcdf/4.10.1/lib:1;/opt/ohpc/pub/libs/gnu16/openmpi5/phdf5/2.2.0/lib:1;/opt/ohpc/pub/mpi/ucx-ohpc/1.22.0/lib:1;/opt/ohpc/pub/libs/hwloc/lib:1;/opt/ohpc/pub/mpi/openmpi5-gnu16/5.0.11/lib:1;/opt/ohpc/pub/compiler/gcc/16.2.0/lib64:1
BATS_JUNIT_GROUP=UserLevelTests
BATS_LIB_PATH=/usr/lib/bats
PARALLEL_JOBSLOT=1
BATS_LIBEXEC=/usr/libexec/bats-core
BATS_SUITE_TEST_NUMBER=7
BATS_ROOT=/usr
DELIMITER=gnu16/openmpi5
OLDPWD=/home/ohpc-test/tests/libs/netcdf/tests
VERBOSE=1
BATS_SAVED_PATH=/opt/ohpc/pub/libs/gnu16/openmpi5/netcdf-fortran/4.6.4/bin:/opt/ohpc/pub/libs/gnu16/openmpi5/netcdf-cxx/4.3.1/bin:/opt/ohpc/pub/libs/gnu16/openmpi5/netcdf/4.10.1/bin:/opt/ohpc/pub/libs/gnu16/openmpi5/phdf5/2.2.0/bin:/opt/ohpc/pub/mpi/ucx-ohpc/1.22.0/bin:/opt/ohpc/pub/libs/hwloc/bin:/opt/ohpc/pub/mpi/openmpi5-gnu16/5.0.11/bin:/opt/ohpc/pub/compiler/gcc/16.2.0/bin:/opt/ohpc/pub/utils/prun/3:/home/ohpc-test/.local/bin:/home/ohpc-test/bin:/opt/xcat/bin:/opt/xcat/sbin:/opt/xcat/share/xcat/tools:/sbin:/bin:/usr/sbin:/usr/bin:/usr/local/sbin
BASH_FUNC_ml%%=() { eval "$($LMOD_DIR/ml_cmd "$@")"
}
BASH_FUNC_bats_semaphore_acquire_while_locked%%=() { if [[ $(bats_semaphore_get_free_slot_count) -gt 0 ]]; then
local slot=0;
while [[ -e "$BATS_SEMAPHORE_DIR/slot-$slot" ]]; do
((++slot));
done;
if [[ $slot -lt $BATS_SEMAPHORE_NUMBER_OF_SLOTS ]]; then
touch "$BATS_SEMAPHORE_DIR/slot-$slot" && printf "%d\n" "$slot" && return 0;
fi;
fi;
return 1
}
BASH_FUNC_bats_readlinkf%%=() { readlink -f "$1"
}
BASH_FUNC_clearLmod%%=() { module --force purge;
eval $($LMOD_DIR/clearLMOD_cmd --shell bash --full "$@")
}
BASH_FUNC_bats_semaphore_get_free_slot_count%%=() { until used_slots=$(find "$BATS_SEMAPHORE_DIR" -name 'slot-*' 2> /dev/null | wc -l); do
:;
done;
echo $((BATS_SEMAPHORE_NUMBER_OF_SLOTS - used_slots))
}
BASH_FUNC_module%%=() { if [ -z "${LMOD_SH_DBG_ON+x}" ]; then
case "$-" in
*v*x*)
__lmod_sh_dbg='vx'
;;
*v*)
__lmod_sh_dbg='v'
;;
*x*)
__lmod_sh_dbg='x'
;;
esac;
fi;
if [ -n "${__lmod_sh_dbg:-}" ]; then
set +$__lmod_sh_dbg;
echo "Shell debugging temporarily silenced: export LMOD_SH_DBG_ON=1 for Lmod's output" 1>&2;
fi;
__lmod_internal_module_cmd "$@";
__lmod_my_status=$?;
if [ -n "${__lmod_sh_dbg:-}" ]; then
echo "Shell debugging restarted" 1>&2;
set -$__lmod_sh_dbg;
fi;
unset __lmod_sh_dbg;
return $__lmod_my_status
}
BASH_FUNC___lmod_internal_module_cmd%%=() { eval "$(__LMOD_PROTECTED_LD_LIBRARY_PATH=${LD_LIBRARY_PATH:-} __LMOD_PROTECTED_LD_PRELOAD=${LD_PRELOAD:-} LD_LIBRARY_PATH= LD_PRELOAD= $LMOD_CMD bash --protected_vars "$@")" && eval $(LD_LIBRARY_PATH= LD_PRELOAD= ${LMOD_SETTARG_CMD:-:} -s sh)
}
BASH_FUNC_clearMT%%=() { eval $($LMOD_DIR/clearLMOD_cmd --shell bash --simple)
}
_=/bin/printenv
-- command failed --
status : 239
output (5 lines):
srun: job 273 queued and waiting for resources
srun: job 273 has been allocated resources
srun: error: Task launch for StepId=273.0 failed on node c2: Protocol authentication error
srun: error: Application launch failed: Protocol authentication error
srun: Job step aborted
--
| Test case: | [libs/NetCDF] C++ write/read (slurm/gnu16/openmpi5) |
|---|---|
| Outcome: | Failed |
| Duration: | 0.936 sec |
| Failed |
(from function `assert_success' in file ./common/test_helper_functions.bash, line 58, in test file test_netcdf, line 180) `assert_success' failed -- command failed -- status : 239 output (5 lines): srun: job 274 queued and waiting for resources srun: job 274 has been allocated resources srun: error: Task launch for StepId=274.0 failed on node c1: Protocol authentication error srun: error: Application launch failed: Protocol authentication error srun: Job step aborted --
| Duration | 0.416 sec |
|---|---|
| Tests | 9 |
| Failures | 0 |
| Test case: | [libs/NetCDF] Verify NETCDF module is loaded and matches rpm version (gnu16/mpich) |
|---|---|
| Outcome: | Passed |
| Duration: | 0.219 sec |
| Test case: | [libs/NetCDF] Verify module NETCDF_DIR is defined and exists (gnu16/mpich) |
|---|---|
| Outcome: | Passed |
| Duration: | 0.021 sec |
| Test case: | [libs/NetCDF] Verify module NETCDF_BIN is defined and exists (gnu16/mpich) |
|---|---|
| Outcome: | Passed |
| Duration: | 0.022 sec |
| Test case: | [libs/NetCDF] Verify availability of nc-config binary (gnu16/mpich) |
|---|---|
| Outcome: | Passed |
| Duration: | 0.05 sec |
| Test case: | [libs/NetCDF] Verify module NETCDF_LIB is defined and exists (gnu16/mpich) |
|---|---|
| Outcome: | Passed |
| Duration: | 0.02 sec |
| Test case: | [libs/NetCDF] Verify dynamic library available in NETCDF_LIB (gnu16/mpich) |
|---|---|
| Outcome: | Passed |
| Duration: | 0.021 sec |
| Test case: | [libs/NetCDF] Verify static library is not present in NETCDF_LIB (gnu16/mpich) |
|---|---|
| Outcome: | Passed |
| Duration: | 0.021 sec |
| Duration | 0.436 sec |
|---|---|
| Tests | 9 |
| Failures | 0 |
| Test case: | [libs/NetCDF-CXX] Verify NETCDF_CXX module is loaded and matches rpm version (gnu16/mpich) |
|---|---|
| Outcome: | Passed |
| Duration: | 0.247 sec |
| Test case: | [libs/NetCDF-CXX] Verify module NETCDF_CXX_DIR is defined and exists (gnu16/mpich) |
|---|---|
| Outcome: | Passed |
| Duration: | 0.02 sec |
| Test case: | [libs/NetCDF-CXX] Verify module NETCDF_CXX_BIN is defined and exists (gnu16/mpich) |
|---|---|
| Outcome: | Passed |
| Duration: | 0.019 sec |
| Test case: | [libs/NetCDF-CXX] Verify availability of ncxx4-config binary (gnu16/mpich) |
|---|---|
| Outcome: | Passed |
| Duration: | 0.045 sec |
| Test case: | [libs/NetCDF-CXX] Verify module NETCDF_CXX_LIB is defined and exists (gnu16/mpich) |
|---|---|
| Outcome: | Passed |
| Duration: | 0.021 sec |
| Test case: | [libs/NetCDF-CXX] Verify dynamic library available in NETCDF_CXX_LIB (gnu16/mpich) |
|---|---|
| Outcome: | Passed |
| Duration: | 0.021 sec |
| Test case: | [libs/NetCDF-CXX] Verify static library is not present in NETCDF_CXX_LIB (gnu16/mpich) |
|---|---|
| Outcome: | Passed |
| Duration: | 0.021 sec |
| Duration | 0.418 sec |
|---|---|
| Tests | 9 |
| Failures | 0 |
| Test case: | [libs/NetCDF-Fortran] Verify NETCDF_FORTRAN module is loaded and matches rpm version (gnu16/mpich) |
|---|---|
| Outcome: | Passed |
| Duration: | 0.226 sec |
| Test case: | [libs/NetCDF-Fortran] Verify module NETCDF_FORTRAN_DIR is defined and exists (gnu16/mpich) |
|---|---|
| Outcome: | Passed |
| Duration: | 0.019 sec |
| Test case: | [libs/NetCDF-Fortran] Verify module NETCDF_FORTRAN_BIN is defined and exists (gnu16/mpich) |
|---|---|
| Outcome: | Passed |
| Duration: | 0.021 sec |
| Test case: | [libs/NetCDF-Fortran] Verify availability of nf-config binary (gnu16/mpich) |
|---|---|
| Outcome: | Passed |
| Duration: | 0.049 sec |
| Test case: | [libs/NetCDF-Fortran] Verify module NETCDF_FORTRAN_LIB is defined and exists (gnu16/mpich) |
|---|---|
| Outcome: | Passed |
| Duration: | 0.021 sec |
| Test case: | [libs/NetCDF-Fortran] Verify dynamic library available in NETCDF_FORTRAN_LIB (gnu16/mpich) |
|---|---|
| Outcome: | Passed |
| Duration: | 0.019 sec |
| Test case: | [libs/NetCDF-Fortran] Verify static library is not present in NETCDF_FORTRAN_LIB (gnu16/mpich) |
|---|---|
| Outcome: | Passed |
| Duration: | 0.022 sec |
| Duration | 1.858 sec |
|---|---|
| Tests | 8 |
| Failures | 3 |
| Test case: | [libs/NetCDF] verify nc4/hdf5 available for C interface (gnu16/mpich) |
|---|---|
| Outcome: | Passed |
| Duration: | 0.086 sec |
| Test case: | [libs/NetCDF] verify nc4 available for Fortran interface (gnu16/mpich) |
|---|---|
| Outcome: | Passed |
| Duration: | 0.063 sec |
| Test case: | [libs/NetCDF] verify nc4 available for C++ interface (gnu16/mpich) |
|---|---|
| Outcome: | Skipped |
| Duration: | 0.0 sec |
| Skipped |
option no longer supported
| Test case: | [libs/NetCDF] C write/read (slurm/gnu16/mpich) |
|---|---|
| Outcome: | Failed |
| Duration: | 0.486 sec |
| Failed |
(from function `assert_success' in file ./common/test_helper_functions.bash, line 58, in test file test_netcdf, line 98) `assert_success' failed total 1440 drwxr-xr-x. 7 ohpc-test ohpc-test 4096 Oct 9 18:28 . drwxr-xr-x. 7 ohpc-test ohpc-test 4096 Oct 9 18:28 .. -rw-r--r--. 1 ohpc-test ohpc-test 5365 Oct 9 08:10 add.c -rw-r--r--. 1 ohpc-test ohpc-test 1327 Oct 9 08:10 add.h -rw-r--r--. 1 ohpc-test ohpc-test 6352 Oct 9 18:28 add.o -rw-r--r--. 1 ohpc-test ohpc-test 50042 Oct 9 08:10 atttests.c -rw-r--r--. 1 ohpc-test ohpc-test 66560 Oct 9 18:28 atttests.o -rw-r--r--. 1 ohpc-test ohpc-test 24221 Oct 9 08:10 cdftests.c -rw-r--r--. 1 ohpc-test ohpc-test 30904 Oct 9 18:28 cdftests.o lrwxrwxrwx. 1 ohpc-test ohpc-test 16 Oct 9 08:10 common -> ../../../common/ -rw-r--r--. 1 ohpc-test ohpc-test 20 Oct 9 08:10 config.h -rw-r--r--. 1 ohpc-test ohpc-test 2072 Oct 9 08:10 COPYRIGHT -rwxr-xr-x. 1 ohpc-test ohpc-test 16768 Oct 9 18:28 C_read -rw-r--r--. 1 ohpc-test ohpc-test 1942 Oct 9 08:10 C_simple_rd.c -rw-r--r--. 1 ohpc-test ohpc-test 2704 Oct 9 18:28 C_simple_rd.o -rw-r--r--. 1 ohpc-test ohpc-test 2657 Oct 9 08:10 C_simple_wr.c -rw-r--r--. 1 ohpc-test ohpc-test 3696 Oct 9 18:28 C_simple_wr.o -rwxr-xr-x. 1 ohpc-test ohpc-test 16960 Oct 9 18:28 C_write -rwxr-xr-x. 1 ohpc-test ohpc-test 26240 Oct 9 18:28 CXX_read -rwxr-xr-x. 1 ohpc-test ohpc-test 38696 Oct 9 18:28 CXX_write drwxr-xr-x. 2 ohpc-test ohpc-test 4096 Oct 9 18:28 .deps -rw-r--r--. 1 ohpc-test ohpc-test 13880 Oct 9 08:10 dimtests.c -rw-r--r--. 1 ohpc-test ohpc-test 18328 Oct 9 18:28 dimtests.o -rw-r--r--. 1 ohpc-test ohpc-test 3879 Oct 9 08:10 driver.c -rw-r--r--. 1 ohpc-test ohpc-test 6352 Oct 9 18:28 driver.o -rw-r--r--. 1 ohpc-test ohpc-test 1082 Oct 9 08:10 emalloc.c -rw-r--r--. 1 ohpc-test ohpc-test 683 Oct 9 08:10 emalloc.h -rw-r--r--. 1 ohpc-test ohpc-test 2176 Oct 9 18:28 emalloc.o -rw-r--r--. 1 ohpc-test ohpc-test 1509 Oct 9 08:10 error.c -rw-r--r--. 1 ohpc-test ohpc-test 920 Oct 9 08:10 error.h -rw-r--r--. 1 ohpc-test ohpc-test 2480 Oct 9 18:28 error.o -rwxr-xr-x. 1 ohpc-test ohpc-test 17648 Oct 9 18:28 F90_read -rwxr-xr-x. 1 ohpc-test ohpc-test 17496 Oct 9 18:28 F90_write drwxr-xr-x. 2 ohpc-test ohpc-test 132 Oct 9 18:28 family-gnu16 drwxr-xr-x. 2 ohpc-test ohpc-test 132 Oct 9 18:27 family-gnu16-mpich drwxr-xr-x. 2 ohpc-test ohpc-test 132 Oct 9 18:27 family-gnu16-mvapich2 drwxr-xr-x. 2 ohpc-test ohpc-test 132 Oct 9 18:27 family-gnu16-openmpi5 -rw-r--r--. 1 ohpc-test ohpc-test 39467 Oct 9 18:28 Makefile -rw-r--r--. 1 ohpc-test ohpc-test 1100 Oct 9 08:10 Makefile.am -rw-r--r--. 1 ohpc-test ohpc-test 40620 Oct 9 18:28 Makefile.in -rw-r--r--. 1 ohpc-test ohpc-test 1633 Oct 9 08:10 misctest.c -rw-r--r--. 1 ohpc-test ohpc-test 3048 Oct 9 18:28 misctest.o -rwxr-xr-x. 1 ohpc-test ohpc-test 122952 Oct 9 18:28 nctest -rw-r--r--. 1 ohpc-test ohpc-test 43696 Oct 9 18:28 nctest_64bit_offset.nc -rw-r--r--. 1 ohpc-test ohpc-test 43584 Oct 9 18:28 nctest_classic.nc -rw-r--r--. 1 ohpc-test ohpc-test 136067 Oct 9 18:28 nctest_netcdf4.nc -rw-r--r--. 1 ohpc-test ohpc-test 16086 Oct 9 08:10 rec.c -rw-r--r--. 1 ohpc-test ohpc-test 15696 Oct 9 18:28 rec.o -rw-r--r--. 1 ohpc-test ohpc-test 43696 Oct 9 08:10 ref_nctest_64bit_offset.nc -rw-r--r--. 1 ohpc-test ohpc-test 43584 Oct 9 08:10 ref_nctest_classic.nc -rw-r--r--. 1 ohpc-test ohpc-test 17173 Oct 9 08:10 simple_xy_nc4.nc.ref -rw-r--r--. 1 ohpc-test ohpc-test 3146 Oct 9 08:10 simple_xy_nc4_rd.f90 -rw-r--r--. 1 ohpc-test ohpc-test 5584 Oct 9 18:28 simple_xy_nc4_rd.o -rw-r--r--. 1 ohpc-test ohpc-test 3307 Oct 9 08:10 simple_xy_nc4_wr.f90 -rw-r--r--. 1 ohpc-test ohpc-test 5088 Oct 9 18:28 simple_xy_nc4_wr.o -rw-r--r--. 1 ohpc-test ohpc-test 1587 Oct 9 08:10 simple_xy_rd.cpp -rw-r--r--. 1 ohpc-test ohpc-test 24512 Oct 9 18:28 simple_xy_rd.o -rw-r--r--. 1 ohpc-test ohpc-test 2477 Oct 9 08:10 simple_xy_wr.cpp -rw-r--r--. 1 ohpc-test ohpc-test 49504 Oct 9 18:28 simple_xy_wr.o -rw-r--r--. 1 ohpc-test ohpc-test 10126 Oct 9 08:10 slabs.c -rw-r--r--. 1 ohpc-test ohpc-test 9944 Oct 9 18:28 slabs.o -rw-r--r--. 1 ohpc-test ohpc-test 32 Oct 9 18:28 temp.tmp -rw-r--r--. 1 ohpc-test ohpc-test 8192 Oct 9 18:28 test2.nc -rw-r--r--. 1 ohpc-test ohpc-test 1605 Oct 9 08:10 testcdf.h -rwxr-xr-x. 1 ohpc-test ohpc-test 3289 Oct 9 08:10 test_C_module -rw-r--r--. 1 ohpc-test ohpc-test 863 Oct 9 18:28 test_C_module.log -rw-r--r--. 1 ohpc-test ohpc-test 1488 Oct 9 18:28 test_C_module.log.xml -rw-r--r--. 1 ohpc-test ohpc-test 82 Oct 9 18:28 test_C_module.trs -rwxr-xr-x. 1 ohpc-test ohpc-test 3267 Oct 9 08:10 test_CXX_module -rw-r--r--. 1 ohpc-test ohpc-test 936 Oct 9 18:28 test_CXX_module.log -rw-r--r--. 1 ohpc-test ohpc-test 1579 Oct 9 18:28 test_CXX_module.log.xml -rw-r--r--. 1 ohpc-test ohpc-test 82 Oct 9 18:28 test_CXX_module.trs -rwxr-xr-x. 1 ohpc-test ohpc-test 3270 Oct 9 08:10 test_Fortran_module -rw-r--r--. 1 ohpc-test ohpc-test 1005 Oct 9 18:28 test_Fortran_module.log -rw-r--r--. 1 ohpc-test ohpc-test 1684 Oct 9 18:28 test_Fortran_module.log.xml -rw-r--r--. 1 ohpc-test ohpc-test 82 Oct 9 18:28 test_Fortran_module.trs -rwxr-xr-x. 1 ohpc-test ohpc-test 3865 Oct 9 08:10 test_netcdf -rw-r--r--. 1 ohpc-test ohpc-test 5 Oct 9 18:28 test_netcdf.log -rw-r--r--. 1 ohpc-test ohpc-test 0 Oct 9 18:28 test_netcdf.log.xml -rw-r--r--. 1 ohpc-test ohpc-test 1863 Oct 9 08:10 tests.h -rw-r--r--. 1 ohpc-test ohpc-test 5527 Oct 9 08:10 val.c -rw-r--r--. 1 ohpc-test ohpc-test 1055 Oct 9 08:10 val.h -rw-r--r--. 1 ohpc-test ohpc-test 5320 Oct 9 18:28 val.o -rw-r--r--. 1 ohpc-test ohpc-test 10076 Oct 9 08:10 vardef.c -rw-r--r--. 1 ohpc-test ohpc-test 13472 Oct 9 18:28 vardef.o -rw-r--r--. 1 ohpc-test ohpc-test 4511 Oct 9 08:10 varget.c -rw-r--r--. 1 ohpc-test ohpc-test 4555 Oct 9 08:10 vargetg.c -rw-r--r--. 1 ohpc-test ohpc-test 6096 Oct 9 18:28 vargetg.o -rw-r--r--. 1 ohpc-test ohpc-test 5768 Oct 9 18:28 varget.o -rw-r--r--. 1 ohpc-test ohpc-test 4719 Oct 9 08:10 varput.c -rw-r--r--. 1 ohpc-test ohpc-test 4707 Oct 9 08:10 varputg.c -rw-r--r--. 1 ohpc-test ohpc-test 6208 Oct 9 18:28 varputg.o -rw-r--r--. 1 ohpc-test ohpc-test 5952 Oct 9 18:28 varput.o -rw-r--r--. 1 ohpc-test ohpc-test 21492 Oct 9 08:10 vartests.c -rw-r--r--. 1 ohpc-test ohpc-test 25448 Oct 9 18:28 vartests.o -rw-r--r--. 1 ohpc-test ohpc-test 4450 Oct 9 08:10 vputget.c -rw-r--r--. 1 ohpc-test ohpc-test 6788 Oct 9 08:10 vputgetg.c -rw-r--r--. 1 ohpc-test ohpc-test 8656 Oct 9 18:28 vputgetg.o -rw-r--r--. 1 ohpc-test ohpc-test 5360 Oct 9 18:28 vputget.o -- command failed -- status : 239 output (5 lines): srun: job 260 queued and waiting for resources srun: job 260 has been allocated resources srun: error: Task launch for StepId=260.0 failed on node c1: Protocol authentication error srun: error: Application launch failed: Protocol authentication error srun: Job step aborted --
| Test case: | [libs/NetCDF] Fortran write/read (slurm/gnu16/mpich) |
|---|---|
| Outcome: | Failed |
| Duration: | 0.539 sec |
| Failed |
(from function `assert_success' in file ./common/test_helper_functions.bash, line 58,
in test file test_netcdf, line 140)
`assert_success' failed
SHELL=/bin/bash
BATS_RUN_LOGS_DIRECTORY=
TEST_DATA=/tmp/tmp.31O4V4HBgw
BATS_TEST_TMPDIR=/tmp/bats-run-afjZF3/test/7
NETCDF_CXX_LIB=/opt/ohpc/pub/libs/gnu16/mpich/netcdf-cxx/4.3.1/lib
SUDO_GID=0
HISTCONTROL=ignoredups
OMPI_MCA_rmaps_base_oversubscribe=1
PARALLEL_JOBSLOT0=0
PKG_CONFIG_PATH=/opt/ohpc/pub/mpi/mpich-ofi-gnu16-ohpc/5.0.2/lib/pkgconfig
HOSTNAME=ohpc-lenovo-sms
HISTSIZE=1048576
FPATH=/opt/ohpc/admin/lmod/lmod/init/ksh_funcs
BATS_LIBDIR=lib
BATS_SUITE_TMPDIR=/tmp/bats-run-afjZF3/suite
BATS_ROOT_PID=332970
BATS_WARNING_FILE=/tmp/bats-run-afjZF3/warnings.log
BATS_FILE_TMPDIR=/tmp/bats-run-afjZF3/file/0
_ModuleTable007_=bUJhc2VNUEFUSCA9ICIvb3B0L29ocGMvcHViL21vZHVsZWZpbGVzIiwKfQo=
_ModuleTable002_=ZSIsCnVzZXJOYW1lID0gImdudTE2IiwKd1YgPSAiMDAwMDAwMDE2LjAwMDAwMDAwMi4qemZpbmFsIiwKfSwKbXBpY2ggPSB7CmFjdGlvbkEgPSB7CltbcHJlcGVuZF9wYXRoKCJNT0RVTEVQQVRIIiwiL29wdC9vaHBjL3B1Yi9tb2R1bGVkZXBzL2dudTE2LW1waWNoIildXSwKfSwKZm4gPSAiL29wdC9vaHBjL3B1Yi9tb2R1bGVkZXBzL2dudTE2L21waWNoLzUuMC4yLW9maSIsCmZ1bGxOYW1lID0gIm1waWNoLzUuMC4yLW9maSIsCmxvYWRPcmRlciA9IDMsCnByb3BUID0ge30sCnN0YWNrRGVwdGggPSAwLApzdGF0dXMgPSAiYWN0aXZlIiwKdXNlck5hbWUgPSAibXBpY2giLAp3ViA9ICIwMDAwMDAwMDUuMDAwMDAwMDAwLjAwMDAwMDAwMi4qb2ZpLip6ZmluYWwiLAp9LApuZXRj
HDF5_DIR=/opt/ohpc/pub/libs/gnu16/mpich/phdf5/2.2.0
BATS_SEMAPHORE_DIR=/tmp/bats-run-afjZF3/semaphores
__LMOD_REF_COUNT_MODULEPATH=/opt/ohpc/pub/moduledeps/gnu16-mpich:1;/opt/ohpc/pub/moduledeps/gnu16:1;/opt/ohpc/pub/modulefiles:1
CXX_DATA=/tmp/tmp.pLy851JmCg
_ModuleTable005_=cHQvb2hwYy9wdWIvbW9kdWxlZGVwcy9nbnUxNi1tcGljaC9uZXRjZGYtZm9ydHJhbi80LjYuNCIsCmZ1bGxOYW1lID0gIm5ldGNkZi1mb3J0cmFuLzQuNi40IiwKbG9hZE9yZGVyID0gNywKcHJvcFQgPSB7fSwKc3RhY2tEZXB0aCA9IDAsCnN0YXR1cyA9ICJhY3RpdmUiLAp1c2VyTmFtZSA9ICJuZXRjZGYtZm9ydHJhbiIsCndWID0gIjAwMDAwMDAwNC4wMDAwMDAwMDYuMDAwMDAwMDA0Lip6ZmluYWwiLAp9LApwaGRmNSA9IHsKZm4gPSAiL29wdC9vaHBjL3B1Yi9tb2R1bGVkZXBzL2dudTE2LW1waWNoL3BoZGY1LzIuMi4wIiwKZnVsbE5hbWUgPSAicGhkZjUvMi4yLjAiLApsb2FkT3JkZXIgPSA0LApwcm9wVCA9IHt9LApyZWZfY291bnQgPSAxLApzdGFja0RlcHRoID0gMSwK
TEST_LOGS=test_C_module.log test_CXX_module.log test_Fortran_module.log test_netcdf.log
LMOD_FAMILY_HDF5_VERSION=2.2.0
SSHPASS=
NETCDF_CXX_BIN=/opt/ohpc/pub/libs/gnu16/mpich/netcdf-cxx/4.3.1/bin
BATS_END_CODE_QUOTE='
SUDO_COMMAND=/bin/bash -c /tmp/user_integration_tests
SUDO_USER=root
BATS_TEST_SOURCE=/home/ohpc-test/tests/libs/netcdf/tests/test_netcdf
BATS_TEST_NAME=test_-5b-24-7bTESTNAME-7d-5d_Fortran_write-2fread_-28-24RESOURCE-5fMANAGER-2f-24-7bDELIMITER-7d-29
GPG_TTY=not a tty
LMOD_DIR=/opt/ohpc/admin/lmod/lmod/libexec
PWD=/home/ohpc-test/tests/libs/netcdf/tests
LOGNAME=ohpc-test
MODULESHOME=/opt/ohpc/admin/lmod/lmod
PARALLEL_TMP=/tmp/parPjEsO
MANPATH=/opt/ohpc/pub/libs/gnu16/mpich/netcdf-fortran/4.6.4/share/man:/opt/ohpc/pub/libs/gnu16/mpich/netcdf-cxx/4.3.1/share/man:/opt/ohpc/pub/libs/gnu16/mpich/netcdf/4.10.1/share/man:/opt/ohpc/pub/mpi/mpich-ofi-gnu16-ohpc/5.0.2/share/man:/opt/ohpc/pub/compiler/gcc/16.2.0/share/man:/opt/xcat/share/man:/opt/ohpc/admin/lmod/lmod/share/man::
NETCDF_FORTRAN_DIR=/opt/ohpc/pub/libs/gnu16/mpich/netcdf-fortran/4.6.4
BATS_JUNIT_FORMAT=1
CI_CLUSTER=lenovo
LMOD_PREPEND_BLOCK=normal
SUDO_HOME=/root
BATS_TMPDIR=/tmp
__LMOD_REF_COUNT_INCLUDE=/opt/ohpc/pub/libs/gnu16/mpich/netcdf-fortran/4.6.4/include:1;/opt/ohpc/pub/libs/gnu16/mpich/netcdf-cxx/4.3.1/include:1;/opt/ohpc/pub/libs/gnu16/mpich/netcdf/4.10.1/include:1;/opt/ohpc/pub/libs/gnu16/mpich/phdf5/2.2.0/include:1;/opt/ohpc/pub/compiler/gcc/16.2.0/include:1
BATS_USE_MKTEMP=1
BATS_TEST_DESCRIPTION=[libs/NetCDF] Fortran write/read (slurm/gnu16/mpich)
NETCDF_FORTRAN_INC=/opt/ohpc/pub/libs/gnu16/mpich/netcdf-fortran/4.6.4/include
__LMOD_REF_COUNT_PATH=/opt/ohpc/pub/libs/gnu16/mpich/netcdf-fortran/4.6.4/bin:1;/opt/ohpc/pub/libs/gnu16/mpich/netcdf-cxx/4.3.1/bin:1;/opt/ohpc/pub/libs/gnu16/mpich/netcdf/4.10.1/bin:1;/opt/ohpc/pub/libs/gnu16/mpich/phdf5/2.2.0/bin:1;/opt/ohpc/pub/mpi/mpich-ofi-gnu16-ohpc/5.0.2/bin:1;/opt/ohpc/pub/compiler/gcc/16.2.0/bin:1;/opt/ohpc/pub/utils/prun/3:1;/home/ohpc-test/.local/bin:1;/home/ohpc-test/bin:1;/opt/xcat/bin:1;/opt/xcat/sbin:1;/opt/xcat/share/xcat/tools:1;/sbin:1;/bin:1;/usr/sbin:1;/usr/bin:1;/usr/local/sbin:1
HOME=/home/ohpc-test
FI_PROVIDER=sockets
PARALLEL_RSYNC_OPTS=-rlDzR
_ModuleTable_Sz_=7
LANG=en_US.UTF-8
BATS_TEST_FILENAME=/home/ohpc-test/tests/libs/netcdf/tests/test_netcdf
__LMOD_REF_COUNT_PKG_CONFIG_PATH=/opt/ohpc/pub/mpi/mpich-ofi-gnu16-ohpc/5.0.2/lib/pkgconfig:1
srcdir=.
NETCDF_FORTRAN_LIB=/opt/ohpc/pub/libs/gnu16/mpich/netcdf-fortran/4.6.4/lib
PARALLEL_PID=333031
BATS_RUN_TMPDIR=/tmp/bats-run-afjZF3
LMOD_SETTARG_FULL_SUPPORT=no
BATS_JUNIT_CLASS=NetCDF
HDF5_INC=/opt/ohpc/pub/libs/gnu16/mpich/phdf5/2.2.0/include
BATS_VERSION=1.11.1
TMPDIR=/tmp
F_DATA=/tmp/tmp.69WstzdFm2
https_proxy=http://10.241.58.130:3128
NETCDF_INC=/opt/ohpc/pub/libs/gnu16/mpich/netcdf/4.10.1/include
PERL5LIB=/usr/local/share/perl5:
NETCDF_DIR=/opt/ohpc/pub/libs/gnu16/mpich/netcdf/4.10.1
XCATROOT=/opt/xcat
LMOD_VERSION=9.4.2
BATS_GUARANTEED_MINIMUM_VERSION=0.0.0
HDF5_BIN=/opt/ohpc/pub/libs/gnu16/mpich/phdf5/2.2.0/bin
TESTNAME=libs/NetCDF
SINGULARITY_TMPDIR=/var/tmp
MFLAGS=-k --no-print-directory
_ModuleTable003_=ZGYgPSB7CmRlcFQgPSB7CmRlcEEgPSB7CnsKc24gPSAicGhkZjUiLAp2ZXJzaW9uID0gewpraW5kID0gImJvb2wiLAp2YWx1ZSA9IHRydWUsCn0sCn0sCn0sCn0sCmZuID0gIi9vcHQvb2hwYy9wdWIvbW9kdWxlZGVwcy9nbnUxNi1tcGljaC9uZXRjZGYvNC4xMC4xIiwKZnVsbE5hbWUgPSAibmV0Y2RmLzQuMTAuMSIsCmxvYWRPcmRlciA9IDUsCnByb3BUID0ge30sCnN0YWNrRGVwdGggPSAwLApzdGF0dXMgPSAiYWN0aXZlIiwKdXNlck5hbWUgPSAibmV0Y2RmIiwKd1YgPSAiMDAwMDAwMDA0LjAwMDAwMDAxMC4wMDAwMDAwMDEuKnpmaW5hbCIsCn0sClsibmV0Y2RmLWN4eCJdID0gewpkZXBUID0gewpkZXBBID0gewp7CnNuID0gIm5ldGNkZiIsCnZlcnNpb24gPSB7CmtpbmQg
PARALLEL_SEQ=1
AUTOMAKE_JUNIT_FILE=1
BATS_CWD=/home/ohpc-test/tests/libs/netcdf/tests
MAKEFLAGS=k --no-print-directory -- TEST_LOGS=test_C_module.log\ test_CXX_module.log\ test_Fortran_module.log\ test_netcdf.log
LMOD_PKG=/opt/ohpc/admin/lmod/lmod
TERM=unknown
BATS_LINE_REFERENCE_FORMAT=comma_line
NETCDF_FORTRAN_BIN=/opt/ohpc/pub/libs/gnu16/mpich/netcdf-fortran/4.6.4/bin
BATS_SEMAPHORE_NUMBER_OF_SLOTS=8
C_DATA=/tmp/tmp.1dRM3fzGoH
LESSOPEN=||/usr/bin/lesspipe.sh %s
NETCDF_CXX_INC=/opt/ohpc/pub/libs/gnu16/mpich/netcdf-cxx/4.3.1/include
PARALLEL_SSHLOGIN=:
USER=ohpc-test
PARALLEL_ENABLED=yes
BATS_BEGIN_CODE_QUOTE=`
HDF5_LIB=/opt/ohpc/pub/libs/gnu16/mpich/phdf5/2.2.0/lib
LOADEDMODULES=prun/3:gnu16/16.2.0:mpich/5.0.2-ofi:phdf5/2.2.0:netcdf/4.10.1:netcdf-cxx/4.3.1:netcdf-fortran/4.6.4
BATS_TEMPDIR_CLEANUP=1
INCLUDE=/opt/ohpc/pub/libs/gnu16/mpich/netcdf-fortran/4.6.4/include:/opt/ohpc/pub/libs/gnu16/mpich/netcdf-cxx/4.3.1/include:/opt/ohpc/pub/libs/gnu16/mpich/netcdf/4.10.1/include:/opt/ohpc/pub/libs/gnu16/mpich/phdf5/2.2.0/include:/opt/ohpc/pub/compiler/gcc/16.2.0/include
LMOD_ROOT=/opt/ohpc/admin/lmod
LMOD_SETTARG_CMD=:
SHLVL=10
BASH_ENV=/opt/ohpc/admin/lmod/lmod/init/bash
_ModuleTable006_=c3RhdHVzID0gImFjdGl2ZSIsCnVzZXJOYW1lID0gInBoZGY1IiwKd1YgPSAiMDAwMDAwMDAyLjAwMDAwMDAwMi4qemZpbmFsIiwKfSwKcHJ1biA9IHsKZm4gPSAiL29wdC9vaHBjL3B1Yi9tb2R1bGVmaWxlcy9wcnVuLzMiLApmdWxsTmFtZSA9ICJwcnVuLzMiLApsb2FkT3JkZXIgPSAxLApwcm9wVCA9IHt9LApzdGFja0RlcHRoID0gMCwKc3RhdHVzID0gImFjdGl2ZSIsCnVzZXJOYW1lID0gInBydW4iLAp3ViA9ICIwMDAwMDAwMDMuKnpmaW5hbCIsCn0sCn0sCm1wYXRoQSA9IHsKIi9vcHQvb2hwYy9wdWIvbW9kdWxlZGVwcy9nbnUxNi1tcGljaCIsICIvb3B0L29ocGMvcHViL21vZHVsZWRlcHMvZ251MTYiLCAiL29wdC9vaHBjL3B1Yi9tb2R1bGVmaWxlcyIsCn0sCnN5c3Rl
NETCDF_CXX_DIR=/opt/ohpc/pub/libs/gnu16/mpich/netcdf-cxx/4.3.1
BATS_REPORT_FILENAME=test_netcdf.log.xml
MAKELEVEL=8
LMOD_FULL_SETTARG_SUPPORT=no
MPI_DIR=/opt/ohpc/pub/mpi/mpich-ofi-gnu16-ohpc/5.0.2
LMOD_FAMILY_HDF5=phdf5
__LMOD_REF_COUNT_MANPATH=/opt/ohpc/pub/libs/gnu16/mpich/netcdf-fortran/4.6.4/share/man:1;/opt/ohpc/pub/libs/gnu16/mpich/netcdf-cxx/4.3.1/share/man:1;/opt/ohpc/pub/libs/gnu16/mpich/netcdf/4.10.1/share/man:1;/opt/ohpc/pub/mpi/mpich-ofi-gnu16-ohpc/5.0.2/share/man:1;/opt/ohpc/pub/compiler/gcc/16.2.0/share/man:1;/opt/xcat/share/man:1;/opt/ohpc/admin/lmod/lmod/share/man:1;:1
http_proxy=http://10.241.58.130:3128
PARALLEL_SSHHOST=:
_ModuleTable001_=X01vZHVsZVRhYmxlXyA9IHsKTVR2ZXJzaW9uID0gMywKY19yZWJ1aWxkVGltZSA9IGZhbHNlLApjX3Nob3J0VGltZSA9IGZhbHNlLApkZXB0aFQgPSB7fSwKZmFtaWx5ID0gewpNUEkgPSAibXBpY2giLApjb21waWxlciA9ICJnbnUxNiIsCmhkZjUgPSAicGhkZjUiLAp9LAptVCA9IHsKZ251MTYgPSB7CmFjdGlvbkEgPSB7CltbcHJlcGVuZF9wYXRoKCJNT0RVTEVQQVRIIiwiL29wdC9vaHBjL3B1Yi9tb2R1bGVkZXBzL2dudTE2IildXSwKfSwKZm4gPSAiL29wdC9vaHBjL3B1Yi9tb2R1bGVmaWxlcy9nbnUxNi8xNi4yLjAiLApmdWxsTmFtZSA9ICJnbnUxNi8xNi4yLjAiLApsb2FkT3JkZXIgPSAyLApwcm9wVCA9IHt9LApzdGFja0RlcHRoID0gMCwKc3RhdHVzID0gImFjdGl2
LD_LIBRARY_PATH=/opt/ohpc/pub/libs/gnu16/mpich/netcdf-fortran/4.6.4/lib:/opt/ohpc/pub/libs/gnu16/mpich/netcdf-cxx/4.3.1/lib:/opt/ohpc/pub/libs/gnu16/mpich/netcdf/4.10.1/lib:/opt/ohpc/pub/libs/gnu16/mpich/phdf5/2.2.0/lib:/opt/ohpc/pub/mpi/mpich-ofi-gnu16-ohpc/5.0.2/lib:/opt/ohpc/pub/compiler/gcc/16.2.0/lib64
LMOD_FAMILY_COMPILER=gnu16
LMOD_COLORIZE=no
_ModuleTable004_=PSAiYm9vbCIsCnZhbHVlID0gdHJ1ZSwKfSwKfSwKfSwKfSwKZm4gPSAiL29wdC9vaHBjL3B1Yi9tb2R1bGVkZXBzL2dudTE2LW1waWNoL25ldGNkZi1jeHgvNC4zLjEiLApmdWxsTmFtZSA9ICJuZXRjZGYtY3h4LzQuMy4xIiwKbG9hZE9yZGVyID0gNiwKcHJvcFQgPSB7fSwKc3RhY2tEZXB0aCA9IDAsCnN0YXR1cyA9ICJhY3RpdmUiLAp1c2VyTmFtZSA9ICJuZXRjZGYtY3h4IiwKd1YgPSAiMDAwMDAwMDA0LjAwMDAwMDAwMy4wMDAwMDAwMDEuKnpmaW5hbCIsCn0sClsibmV0Y2RmLWZvcnRyYW4iXSA9IHsKZGVwVCA9IHsKZGVwQSA9IHsKewpzbiA9ICJuZXRjZGYiLAp2ZXJzaW9uID0gewpraW5kID0gImJvb2wiLAp2YWx1ZSA9IHRydWUsCn0sCn0sCn0sCn0sCmZuID0gIi9v
LMOD_FAMILY_MPI_VERSION=5.0.2-ofi
RESOURCE_MANAGER=slurm
BATS_TEST_RETRIES=0
OMP_NUM_THREADS=2
LMOD_FAMILY_MPI=mpich
DEBUGINFOD_IMA_CERT_PATH=/etc/keys/ima:
ALL_ENABLED=yes
BATS_RUNLOG_FILE=/dev/null
PERL_BADLANG=0
LMOD_FAMILY_COMPILER_VERSION=16.2.0
PARALLEL_REMOTE_TMPDIR=/tmp
NETCDF_BIN=/opt/ohpc/pub/libs/gnu16/mpich/netcdf/4.10.1/bin
BATS_TEST_NUMBER=7
BATS_ENABLE_TIMING=-T
PATH=/usr/libexec/bats-core:/opt/ohpc/pub/libs/gnu16/mpich/netcdf-fortran/4.6.4/bin:/opt/ohpc/pub/libs/gnu16/mpich/netcdf-cxx/4.3.1/bin:/opt/ohpc/pub/libs/gnu16/mpich/netcdf/4.10.1/bin:/opt/ohpc/pub/libs/gnu16/mpich/phdf5/2.2.0/bin:/opt/ohpc/pub/mpi/mpich-ofi-gnu16-ohpc/5.0.2/bin:/opt/ohpc/pub/compiler/gcc/16.2.0/bin:/opt/ohpc/pub/utils/prun/3:/home/ohpc-test/.local/bin:/home/ohpc-test/bin:/opt/xcat/bin:/opt/xcat/sbin:/opt/xcat/share/xcat/tools:/sbin:/bin:/usr/sbin:/usr/bin:/usr/local/sbin
NETCDF_LIB=/opt/ohpc/pub/libs/gnu16/mpich/netcdf/4.10.1/lib
MODULEPATH=/opt/ohpc/pub/moduledeps/gnu16-mpich:/opt/ohpc/pub/moduledeps/gnu16:/opt/ohpc/pub/modulefiles
_LMFILES_=/opt/ohpc/pub/modulefiles/prun/3:/opt/ohpc/pub/modulefiles/gnu16/16.2.0:/opt/ohpc/pub/moduledeps/gnu16/mpich/5.0.2-ofi:/opt/ohpc/pub/moduledeps/gnu16-mpich/phdf5/2.2.0:/opt/ohpc/pub/moduledeps/gnu16-mpich/netcdf/4.10.1:/opt/ohpc/pub/moduledeps/gnu16-mpich/netcdf-cxx/4.3.1:/opt/ohpc/pub/moduledeps/gnu16-mpich/netcdf-fortran/4.6.4
SUDO_UID=0
LMOD_CMD=/opt/ohpc/admin/lmod/lmod/libexec/lmod
MAIL=/var/spool/mail/ohpc-test
__LMOD_REF_COUNT_LD_LIBRARY_PATH=/opt/ohpc/pub/libs/gnu16/mpich/netcdf-fortran/4.6.4/lib:1;/opt/ohpc/pub/libs/gnu16/mpich/netcdf-cxx/4.3.1/lib:1;/opt/ohpc/pub/libs/gnu16/mpich/netcdf/4.10.1/lib:1;/opt/ohpc/pub/libs/gnu16/mpich/phdf5/2.2.0/lib:1;/opt/ohpc/pub/mpi/mpich-ofi-gnu16-ohpc/5.0.2/lib:1;/opt/ohpc/pub/compiler/gcc/16.2.0/lib64:1
BATS_JUNIT_GROUP=UserLevelTests
BATS_LIB_PATH=/usr/lib/bats
PARALLEL_JOBSLOT=1
BATS_LIBEXEC=/usr/libexec/bats-core
BATS_SUITE_TEST_NUMBER=7
BATS_ROOT=/usr
DELIMITER=gnu16/mpich
OLDPWD=/home/ohpc-test/tests/libs/netcdf/tests
VERBOSE=1
BATS_SAVED_PATH=/opt/ohpc/pub/libs/gnu16/mpich/netcdf-fortran/4.6.4/bin:/opt/ohpc/pub/libs/gnu16/mpich/netcdf-cxx/4.3.1/bin:/opt/ohpc/pub/libs/gnu16/mpich/netcdf/4.10.1/bin:/opt/ohpc/pub/libs/gnu16/mpich/phdf5/2.2.0/bin:/opt/ohpc/pub/mpi/mpich-ofi-gnu16-ohpc/5.0.2/bin:/opt/ohpc/pub/compiler/gcc/16.2.0/bin:/opt/ohpc/pub/utils/prun/3:/home/ohpc-test/.local/bin:/home/ohpc-test/bin:/opt/xcat/bin:/opt/xcat/sbin:/opt/xcat/share/xcat/tools:/sbin:/bin:/usr/sbin:/usr/bin:/usr/local/sbin
BASH_FUNC_ml%%=() { eval "$($LMOD_DIR/ml_cmd "$@")"
}
BASH_FUNC_bats_semaphore_acquire_while_locked%%=() { if [[ $(bats_semaphore_get_free_slot_count) -gt 0 ]]; then
local slot=0;
while [[ -e "$BATS_SEMAPHORE_DIR/slot-$slot" ]]; do
((++slot));
done;
if [[ $slot -lt $BATS_SEMAPHORE_NUMBER_OF_SLOTS ]]; then
touch "$BATS_SEMAPHORE_DIR/slot-$slot" && printf "%d\n" "$slot" && return 0;
fi;
fi;
return 1
}
BASH_FUNC_bats_readlinkf%%=() { readlink -f "$1"
}
BASH_FUNC_clearLmod%%=() { module --force purge;
eval $($LMOD_DIR/clearLMOD_cmd --shell bash --full "$@")
}
BASH_FUNC_bats_semaphore_get_free_slot_count%%=() { until used_slots=$(find "$BATS_SEMAPHORE_DIR" -name 'slot-*' 2> /dev/null | wc -l); do
:;
done;
echo $((BATS_SEMAPHORE_NUMBER_OF_SLOTS - used_slots))
}
BASH_FUNC_module%%=() { if [ -z "${LMOD_SH_DBG_ON+x}" ]; then
case "$-" in
*v*x*)
__lmod_sh_dbg='vx'
;;
*v*)
__lmod_sh_dbg='v'
;;
*x*)
__lmod_sh_dbg='x'
;;
esac;
fi;
if [ -n "${__lmod_sh_dbg:-}" ]; then
set +$__lmod_sh_dbg;
echo "Shell debugging temporarily silenced: export LMOD_SH_DBG_ON=1 for Lmod's output" 1>&2;
fi;
__lmod_internal_module_cmd "$@";
__lmod_my_status=$?;
if [ -n "${__lmod_sh_dbg:-}" ]; then
echo "Shell debugging restarted" 1>&2;
set -$__lmod_sh_dbg;
fi;
unset __lmod_sh_dbg;
return $__lmod_my_status
}
BASH_FUNC___lmod_internal_module_cmd%%=() { eval "$(__LMOD_PROTECTED_LD_LIBRARY_PATH=${LD_LIBRARY_PATH:-} __LMOD_PROTECTED_LD_PRELOAD=${LD_PRELOAD:-} LD_LIBRARY_PATH= LD_PRELOAD= $LMOD_CMD bash --protected_vars "$@")" && eval $(LD_LIBRARY_PATH= LD_PRELOAD= ${LMOD_SETTARG_CMD:-:} -s sh)
}
BASH_FUNC_clearMT%%=() { eval $($LMOD_DIR/clearLMOD_cmd --shell bash --simple)
}
_=/bin/printenv
-- command failed --
status : 239
output (5 lines):
srun: job 262 queued and waiting for resources
srun: job 262 has been allocated resources
srun: error: Task launch for StepId=262.0 failed on node c1: Protocol authentication error
srun: error: Application launch failed: Protocol authentication error
srun: Job step aborted
--
| Test case: | [libs/NetCDF] C++ write/read (slurm/gnu16/mpich) |
|---|---|
| Outcome: | Failed |
| Duration: | 0.29 sec |
| Failed |
(from function `assert_success' in file ./common/test_helper_functions.bash, line 58, in test file test_netcdf, line 174) `assert_success' failed -- command failed -- status : 239 output (5 lines): srun: job 261 queued and waiting for resources srun: job 261 has been allocated resources srun: error: Task launch for StepId=261.0 failed on node c2: Protocol authentication error srun: error: Application launch failed: Protocol authentication error srun: Job step aborted --
| Duration | 3.301 sec |
|---|---|
| Tests | 11 |
| Failures | 5 |
| Test case: | [libs/OpenBLAS/dblat1] dblat1 under resource manager (slurm/gnu16) |
|---|---|
| Outcome: | Passed |
| Duration: | 0.136 sec |
| Test case: | [libs/OpenBLAS/xccblat1] xccblat1 under resource manager (slurm/gnu16) |
|---|---|
| Outcome: | Passed |
| Duration: | 0.153 sec |
| Test case: | [libs/OpenBLAS/xzcblat1] xzcblat1 under resource manager (slurm/gnu16) |
|---|---|
| Outcome: | Failed |
| Duration: | 0.125 sec |
| Failed |
(from function `run_serial_binary' in file ../../../common/functions, line 287,
in test file rm_execution, line 48)
`run_serial_binary -t "${TIMEOUT}" ./xzcblat1 "${ARGS}"' failed with status 239
srun: job 284 queued and waiting for resources
srun: job 284 has been allocated resources
srun: error: Task launch for StepId=284.0 failed on node c1: Protocol authentication error
srun: error: Application launch failed: Protocol authentication error
srun: Job step aborted
| Test case: | [libs/OpenBLAS/xscblat2] xscblat2 under resource manager (slurm/gnu16) |
|---|---|
| Outcome: | Failed |
| Duration: | 0.138 sec |
| Failed |
(from function `run_serial_binary' in file ../../../common/functions, line 287,
in test file rm_execution, line 57)
`run_serial_binary -t "${TIMEOUT}" ./xscblat2 "${ARGS} < sin2"' failed with status 239
srun: job 285 queued and waiting for resources
srun: job 285 has been allocated resources
srun: error: Task launch for StepId=285.0 failed on node c2: Protocol authentication error
srun: error: Application launch failed: Protocol authentication error
srun: Job step aborted
| Test case: | [libs/OpenBLAS/xdcblat2] xdcblat2 under resource manager (slurm/gnu16) |
|---|---|
| Outcome: | Failed |
| Duration: | 0.072 sec |
| Failed |
(from function `run_serial_binary' in file ../../../common/functions, line 287,
in test file rm_execution, line 66)
`run_serial_binary -t "${TIMEOUT}" ./xdcblat2 "${ARGS} < din2"' failed with status 239
srun: job 286 queued and waiting for resources
srun: job 286 has been allocated resources
srun: error: Task launch for StepId=286.0 failed on node c1: Protocol authentication error
srun: error: Application launch failed: Protocol authentication error
srun: Job step aborted
| Test case: | [libs/OpenBLAS/xccblat2] xccblat2 under resource manager (slurm/gnu16) |
|---|---|
| Outcome: | Passed |
| Duration: | 0.578 sec |
| Test case: | [libs/OpenBLAS/xzcblat2] xzcblat2 under resource manager (slurm/gnu16) |
|---|---|
| Outcome: | Passed |
| Duration: | 0.421 sec |
| Test case: | [libs/OpenBLAS/xscblat3] xscblat3 under resource manager (slurm/gnu16) |
|---|---|
| Outcome: | Failed |
| Duration: | 0.457 sec |
| Failed |
(from function `run_serial_binary' in file ../../../common/functions, line 287,
in test file rm_execution, line 93)
`run_serial_binary -t "${TIMEOUT}" ./xscblat3 "${ARGS} < sin3"' failed with status 239
srun: job 289 queued and waiting for resources
srun: job 289 has been allocated resources
srun: error: Task launch for StepId=289.0 failed on node c1: Protocol authentication error
srun: error: Application launch failed: Protocol authentication error
srun: Job step aborted
| Test case: | [libs/OpenBLAS/xdcblat3] xdcblat3 under resource manager (slurm/gnu16) |
|---|---|
| Outcome: | Failed |
| Duration: | 0.418 sec |
| Failed |
(from function `run_serial_binary' in file ../../../common/functions, line 287,
in test file rm_execution, line 102)
`run_serial_binary -t "${TIMEOUT}" ./xdcblat3 "${ARGS} < din3"' failed with status 239
srun: job 290 queued and waiting for resources
srun: job 290 has been allocated resources
srun: error: Task launch for StepId=290.0 failed on node c2: Protocol authentication error
srun: error: Application launch failed: Protocol authentication error
srun: Job step aborted
| Duration | 0.29 sec |
|---|---|
| Tests | 5 |
| Failures | 0 |
| Test case: | [libs/OpenBLAS] Verify OPENBLAS module is loaded and matches rpm version (gnu16) |
|---|---|
| Outcome: | Passed |
| Duration: | 0.208 sec |
| Test case: | [libs/OpenBLAS] Verify OPENBLAS_DIR is defined and directory exists (gnu16) |
|---|---|
| Outcome: | Passed |
| Duration: | 0.02 sec |
| Test case: | [libs/OpenBLAS] Verify module OPENBLAS_LIB is defined and exists (gnu16) |
|---|---|
| Outcome: | Passed |
| Duration: | 0.02 sec |
| Duration | 5.637 sec |
|---|---|
| Tests | 3 |
| Failures | 0 |
| Duration | 1.561 sec |
|---|---|
| Tests | 8 |
| Failures | 0 |
| Test case: | [libs/PETSc] Verify PETSC module is loaded and matches rpm version (gnu16/mpich) |
|---|---|
| Outcome: | Passed |
| Duration: | 0.25 sec |
| Test case: | [libs/PETSc] Verify module PETSC_DIR is defined and exists (gnu16/mpich) |
|---|---|
| Outcome: | Passed |
| Duration: | 0.022 sec |
| Test case: | [libs/PETSc] Verify module PETSC_LIB is defined and exists (gnu16/mpich) |
|---|---|
| Outcome: | Passed |
| Duration: | 0.017 sec |
| Test case: | [libs/PETSc] Verify dynamic library available in PETSC_LIB (gnu16/mpich) |
|---|---|
| Outcome: | Passed |
| Duration: | 0.018 sec |
| Test case: | [libs/PETSc] Verify static library is not present in PETSC_LIB (gnu16/mpich) |
|---|---|
| Outcome: | Passed |
| Duration: | 0.021 sec |
| Test case: | [libs/PETSc] Verify module PETSC_INC is defined and exists (gnu16/mpich) |
|---|---|
| Outcome: | Passed |
| Duration: | 0.021 sec |
| Duration | 21.445 sec |
|---|---|
| Tests | 3 |
| Failures | 0 |
| Duration | 2.639 sec |
|---|---|
| Tests | 8 |
| Failures | 0 |
| Test case: | [libs/PETSc] Verify PETSC module is loaded and matches rpm version (gnu16/mvapich2) |
|---|---|
| Outcome: | Passed |
| Duration: | 0.264 sec |
| Test case: | [libs/PETSc] Verify module PETSC_DIR is defined and exists (gnu16/mvapich2) |
|---|---|
| Outcome: | Passed |
| Duration: | 0.02 sec |
| Test case: | [libs/PETSc] Verify module PETSC_LIB is defined and exists (gnu16/mvapich2) |
|---|---|
| Outcome: | Passed |
| Duration: | 0.021 sec |
| Test case: | [libs/PETSc] Verify dynamic library available in PETSC_LIB (gnu16/mvapich2) |
|---|---|
| Outcome: | Passed |
| Duration: | 0.023 sec |
| Test case: | [libs/PETSc] Verify static library is not present in PETSC_LIB (gnu16/mvapich2) |
|---|---|
| Outcome: | Passed |
| Duration: | 0.023 sec |
| Test case: | [libs/PETSc] Verify module PETSC_INC is defined and exists (gnu16/mvapich2) |
|---|---|
| Outcome: | Passed |
| Duration: | 0.022 sec |
| Duration | 31.993 sec |
|---|---|
| Tests | 3 |
| Failures | 0 |
| Duration | 3.691 sec |
|---|---|
| Tests | 8 |
| Failures | 0 |
| Test case: | [libs/PETSc] Verify PETSC module is loaded and matches rpm version (gnu16/openmpi5) |
|---|---|
| Outcome: | Passed |
| Duration: | 0.269 sec |
| Test case: | [libs/PETSc] Verify module PETSC_DIR is defined and exists (gnu16/openmpi5) |
|---|---|
| Outcome: | Passed |
| Duration: | 0.021 sec |
| Test case: | [libs/PETSc] Verify module PETSC_LIB is defined and exists (gnu16/openmpi5) |
|---|---|
| Outcome: | Passed |
| Duration: | 0.018 sec |
| Test case: | [libs/PETSc] Verify dynamic library available in PETSC_LIB (gnu16/openmpi5) |
|---|---|
| Outcome: | Passed |
| Duration: | 0.02 sec |
| Test case: | [libs/PETSc] Verify static library is not present in PETSC_LIB (gnu16/openmpi5) |
|---|---|
| Outcome: | Passed |
| Duration: | 0.021 sec |
| Test case: | [libs/PETSc] Verify module PETSC_INC is defined and exists (gnu16/openmpi5) |
|---|---|
| Outcome: | Passed |
| Duration: | 0.021 sec |
| Duration | 0.339 sec |
|---|---|
| Tests | 7 |
| Failures | 0 |
| Test case: | [libs/PHDF5] Verify HDF5 module is loaded and matches rpm version (gnu16-mpich) |
|---|---|
| Outcome: | Passed |
| Duration: | 0.22 sec |
| Test case: | [libs/PHDF5] Verify HDF5_DIR is defined and directory exists (gnu16-mpich) |
|---|---|
| Outcome: | Passed |
| Duration: | 0.019 sec |
| Test case: | [libs/PHDF5] Verify module HDF5_LIB is defined and exists (gnu16-mpich) |
|---|---|
| Outcome: | Passed |
| Duration: | 0.019 sec |
| Test case: | [libs/PHDF5] Verify dynamic library available in HDF5_LIB (gnu16-mpich) |
|---|---|
| Outcome: | Passed |
| Duration: | 0.021 sec |
| Test case: | [libs/PHDF5] Verify static library is not present in HDF5_LIB (gnu16-mpich) |
|---|---|
| Outcome: | Passed |
| Duration: | 0.02 sec |
| Duration | 0.337 sec |
|---|---|
| Tests | 7 |
| Failures | 0 |
| Test case: | [libs/PHDF5] Verify HDF5 module is loaded and matches rpm version (gnu16-mvapich2) |
|---|---|
| Outcome: | Passed |
| Duration: | 0.217 sec |
| Test case: | [libs/PHDF5] Verify HDF5_DIR is defined and directory exists (gnu16-mvapich2) |
|---|---|
| Outcome: | Passed |
| Duration: | 0.021 sec |
| Test case: | [libs/PHDF5] Verify module HDF5_LIB is defined and exists (gnu16-mvapich2) |
|---|---|
| Outcome: | Passed |
| Duration: | 0.019 sec |
| Test case: | [libs/PHDF5] Verify dynamic library available in HDF5_LIB (gnu16-mvapich2) |
|---|---|
| Outcome: | Passed |
| Duration: | 0.019 sec |
| Test case: | [libs/PHDF5] Verify static library is not present in HDF5_LIB (gnu16-mvapich2) |
|---|---|
| Outcome: | Passed |
| Duration: | 0.02 sec |
| Duration | 0.363 sec |
|---|---|
| Tests | 7 |
| Failures | 0 |
| Test case: | [libs/PHDF5] Verify HDF5 module is loaded and matches rpm version (gnu16-openmpi5) |
|---|---|
| Outcome: | Passed |
| Duration: | 0.241 sec |
| Test case: | [libs/PHDF5] Verify HDF5_DIR is defined and directory exists (gnu16-openmpi5) |
|---|---|
| Outcome: | Passed |
| Duration: | 0.021 sec |
| Test case: | [libs/PHDF5] Verify module HDF5_LIB is defined and exists (gnu16-openmpi5) |
|---|---|
| Outcome: | Passed |
| Duration: | 0.019 sec |
| Test case: | [libs/PHDF5] Verify dynamic library available in HDF5_LIB (gnu16-openmpi5) |
|---|---|
| Outcome: | Passed |
| Duration: | 0.019 sec |
| Test case: | [libs/PHDF5] Verify static library is not present in HDF5_LIB (gnu16-openmpi5) |
|---|---|
| Outcome: | Passed |
| Duration: | 0.019 sec |
| Duration | 0.341 sec |
|---|---|
| Tests | 7 |
| Failures | 0 |
| Test case: | [libs/PLASMA] Verify PLASMA module is loaded and matches rpm version (gnu16) |
|---|---|
| Outcome: | Passed |
| Duration: | 0.227 sec |
| Test case: | [libs/PLASMA] Verify PLASMA_DIR is defined and directory exists (gnu16) |
|---|---|
| Outcome: | Passed |
| Duration: | 0.018 sec |
| Test case: | [libs/PLASMA] Verify module PLASMA_LIB is defined and exists (gnu16) |
|---|---|
| Outcome: | Passed |
| Duration: | 0.019 sec |
| Test case: | [libs/PLASMA] Verify dynamic library available in PLASMA_LIB (gnu16) |
|---|---|
| Outcome: | Passed |
| Duration: | 0.019 sec |
| Test case: | [libs/PLASMA] Verify static library is not present in PLASMA_LIB (gnu16) |
|---|---|
| Outcome: | Passed |
| Duration: | 0.02 sec |
| Duration | 0.248 sec |
|---|---|
| Tests | 5 |
| Failures | 0 |
| Test case: | [PNETCDF] Verify PNETCDF module is loaded and matches rpm version (gnu16) |
|---|---|
| Outcome: | Passed |
| Duration: | 0.209 sec |
| Test case: | [PNETCDF] Verify module PNETCDF_DIR is defined and exists (gnu16) |
|---|---|
| Outcome: | Passed |
| Duration: | 0.011 sec |
| Test case: | [PNETCDF] Verify module PNETCDF_LIB is defined and exists (gnu16) |
|---|---|
| Outcome: | Passed |
| Duration: | 0.009 sec |
| Duration | 18.372 sec |
|---|---|
| Tests | 4 |
| Failures | 0 |
| Test case: | [libs/PNETCDF] Parallel Fortran binary runs under resource manager (slurm/gnu16/openmpi5) |
|---|---|
| Outcome: | Passed |
| Duration: | 8.529 sec |
| Test case: | [libs/PNETCDF] Parallel Fortran binary 2 runs under resource manager (slurm/gnu16/openmpi5) |
|---|---|
| Outcome: | Passed |
| Duration: | 3.279 sec |
| Duration | 11.0 sec |
|---|---|
| Tests | 4 |
| Failures | 0 |
| Test case: | [libs/PNETCDF] Parallel Fortran binary runs under resource manager (slurm/gnu16/mpich) |
|---|---|
| Outcome: | Passed |
| Duration: | 1.173 sec |
| Test case: | [libs/PNETCDF] Parallel Fortran binary 2 runs under resource manager (slurm/gnu16/mpich) |
|---|---|
| Outcome: | Passed |
| Duration: | 3.275 sec |
| Duration | 8.89 sec |
|---|---|
| Tests | 4 |
| Failures | 0 |
| Test case: | [libs/PNETCDF] Parallel Fortran binary runs under resource manager (slurm/gnu16/mvapich2) |
|---|---|
| Outcome: | Passed |
| Duration: | 1.173 sec |
| Test case: | [libs/PNETCDF] Parallel Fortran binary 2 runs under resource manager (slurm/gnu16/mvapich2) |
|---|---|
| Outcome: | Passed |
| Duration: | 3.273 sec |
| Duration | 15.091 sec |
|---|---|
| Tests | 3 |
| Failures | 0 |
| Duration | 0.382 sec |
|---|---|
| Tests | 9 |
| Failures | 0 |
| Test case: | [libs/PTScotch] Verify PTSCOTCH module is loaded and matches rpm version (gnu16-mpich) |
|---|---|
| Outcome: | Passed |
| Duration: | 0.213 sec |
| Test case: | [libs/PTScotch] Verify PTSCOTCH_DIR is defined and directory exists (gnu16-mpich) |
|---|---|
| Outcome: | Passed |
| Duration: | 0.02 sec |
| Test case: | [libs/PTScotch] Verify module PTSCOTCH_LIB is defined and exists (gnu16-mpich) |
|---|---|
| Outcome: | Passed |
| Duration: | 0.019 sec |
| Test case: | [libs/PTScotch] Verify dynamic library available in PTSCOTCH_LIB (gnu16-mpich) |
|---|---|
| Outcome: | Passed |
| Duration: | 0.02 sec |
| Test case: | [libs/PTScotch] Verify static library is not present in PTSCOTCH_LIB (gnu16-mpich) |
|---|---|
| Outcome: | Passed |
| Duration: | 0.019 sec |
| Test case: | [libs/PTScotch] Verify module PTSCOTCH_INC is defined and exists (gnu16-mpich) |
|---|---|
| Outcome: | Passed |
| Duration: | 0.019 sec |
| Test case: | [libs/PTScotch] Verify header file is present in PTSCOTCH_INC (gnu16-mpich) |
|---|---|
| Outcome: | Passed |
| Duration: | 0.021 sec |
| Duration | 4.572 sec |
|---|---|
| Tests | 3 |
| Failures | 0 |
| Duration | 0.382 sec |
|---|---|
| Tests | 9 |
| Failures | 0 |
| Test case: | [libs/PTScotch] Verify PTSCOTCH module is loaded and matches rpm version (gnu16-mvapich2) |
|---|---|
| Outcome: | Passed |
| Duration: | 0.212 sec |
| Test case: | [libs/PTScotch] Verify PTSCOTCH_DIR is defined and directory exists (gnu16-mvapich2) |
|---|---|
| Outcome: | Passed |
| Duration: | 0.021 sec |
| Test case: | [libs/PTScotch] Verify module PTSCOTCH_LIB is defined and exists (gnu16-mvapich2) |
|---|---|
| Outcome: | Passed |
| Duration: | 0.019 sec |
| Test case: | [libs/PTScotch] Verify dynamic library available in PTSCOTCH_LIB (gnu16-mvapich2) |
|---|---|
| Outcome: | Passed |
| Duration: | 0.019 sec |
| Test case: | [libs/PTScotch] Verify static library is not present in PTSCOTCH_LIB (gnu16-mvapich2) |
|---|---|
| Outcome: | Passed |
| Duration: | 0.021 sec |
| Test case: | [libs/PTScotch] Verify module PTSCOTCH_INC is defined and exists (gnu16-mvapich2) |
|---|---|
| Outcome: | Passed |
| Duration: | 0.021 sec |
| Test case: | [libs/PTScotch] Verify header file is present in PTSCOTCH_INC (gnu16-mvapich2) |
|---|---|
| Outcome: | Passed |
| Duration: | 0.019 sec |
| Duration | 10.894 sec |
|---|---|
| Tests | 3 |
| Failures | 0 |
| Duration | 0.42 sec |
|---|---|
| Tests | 9 |
| Failures | 0 |
| Test case: | [libs/PTScotch] Verify PTSCOTCH module is loaded and matches rpm version (gnu16-openmpi5) |
|---|---|
| Outcome: | Passed |
| Duration: | 0.243 sec |
| Test case: | [libs/PTScotch] Verify PTSCOTCH_DIR is defined and directory exists (gnu16-openmpi5) |
|---|---|
| Outcome: | Passed |
| Duration: | 0.021 sec |
| Test case: | [libs/PTScotch] Verify module PTSCOTCH_LIB is defined and exists (gnu16-openmpi5) |
|---|---|
| Outcome: | Passed |
| Duration: | 0.021 sec |
| Test case: | [libs/PTScotch] Verify dynamic library available in PTSCOTCH_LIB (gnu16-openmpi5) |
|---|---|
| Outcome: | Passed |
| Duration: | 0.021 sec |
| Test case: | [libs/PTScotch] Verify static library is not present in PTSCOTCH_LIB (gnu16-openmpi5) |
|---|---|
| Outcome: | Passed |
| Duration: | 0.021 sec |
| Test case: | [libs/PTScotch] Verify module PTSCOTCH_INC is defined and exists (gnu16-openmpi5) |
|---|---|
| Outcome: | Passed |
| Duration: | 0.021 sec |
| Test case: | [libs/PTScotch] Verify header file is present in PTSCOTCH_INC (gnu16-openmpi5) |
|---|---|
| Outcome: | Passed |
| Duration: | 0.021 sec |
| Duration | 32.042 sec |
|---|---|
| Tests | 4 |
| Failures | 0 |
| Test case: | [libs/ScaLAPACK/PCSCAEX] CPCGESV under resource manager (slurm/gnu16/mpich) |
|---|---|
| Outcome: | Passed |
| Duration: | 7.493 sec |
| Test case: | [libs/ScaLAPACK/PDSCAEX] DPCGESV under resource manager (slurm/gnu16/mpich) |
|---|---|
| Outcome: | Passed |
| Duration: | 7.48 sec |
| Duration | 0.295 sec |
|---|---|
| Tests | 5 |
| Failures | 0 |
| Test case: | [libs/ScaLAPACK] Verify SCALAPACK module is loaded and matches rpm version (gnu16/mpich) |
|---|---|
| Outcome: | Passed |
| Duration: | 0.214 sec |
| Test case: | [libs/ScaLAPACK] Verify module SCALAPACK_DIR is defined and exists (gnu16/mpich) |
|---|---|
| Outcome: | Passed |
| Duration: | 0.02 sec |
| Test case: | [libs/ScaLAPACK] Verify module SCALAPACK_LIB is defined and exists (gnu16/mpich) |
|---|---|
| Outcome: | Passed |
| Duration: | 0.02 sec |
| Duration | 32.034 sec |
|---|---|
| Tests | 4 |
| Failures | 0 |
| Test case: | [libs/ScaLAPACK/PCSCAEX] CPCGESV under resource manager (slurm/gnu16/mvapich2) |
|---|---|
| Outcome: | Passed |
| Duration: | 7.486 sec |
| Test case: | [libs/ScaLAPACK/PDSCAEX] DPCGESV under resource manager (slurm/gnu16/mvapich2) |
|---|---|
| Outcome: | Passed |
| Duration: | 7.479 sec |
| Duration | 0.296 sec |
|---|---|
| Tests | 5 |
| Failures | 0 |
| Test case: | [libs/ScaLAPACK] Verify SCALAPACK module is loaded and matches rpm version (gnu16/mvapich2) |
|---|---|
| Outcome: | Passed |
| Duration: | 0.213 sec |
| Test case: | [libs/ScaLAPACK] Verify module SCALAPACK_DIR is defined and exists (gnu16/mvapich2) |
|---|---|
| Outcome: | Passed |
| Duration: | 0.02 sec |
| Test case: | [libs/ScaLAPACK] Verify module SCALAPACK_LIB is defined and exists (gnu16/mvapich2) |
|---|---|
| Outcome: | Passed |
| Duration: | 0.02 sec |
| Duration | 46.822 sec |
|---|---|
| Tests | 4 |
| Failures | 0 |
| Test case: | [libs/ScaLAPACK/PCSCAEX] CPCGESV under resource manager (slurm/gnu16/openmpi5) |
|---|---|
| Outcome: | Passed |
| Duration: | 8.549 sec |
| Test case: | [libs/ScaLAPACK/PDSCAEX] DPCGESV under resource manager (slurm/gnu16/openmpi5) |
|---|---|
| Outcome: | Passed |
| Duration: | 10.653 sec |
| Duration | 0.297 sec |
|---|---|
| Tests | 5 |
| Failures | 0 |
| Test case: | [libs/ScaLAPACK] Verify SCALAPACK module is loaded and matches rpm version (gnu16/openmpi5) |
|---|---|
| Outcome: | Passed |
| Duration: | 0.216 sec |
| Test case: | [libs/ScaLAPACK] Verify module SCALAPACK_DIR is defined and exists (gnu16/openmpi5) |
|---|---|
| Outcome: | Passed |
| Duration: | 0.023 sec |
| Test case: | [libs/ScaLAPACK] Verify module SCALAPACK_LIB is defined and exists (gnu16/openmpi5) |
|---|---|
| Outcome: | Passed |
| Duration: | 0.02 sec |
| Duration | 0.552 sec |
|---|---|
| Tests | 3 |
| Failures | 0 |
| Duration | 0.377 sec |
|---|---|
| Tests | 9 |
| Failures | 0 |
| Test case: | [libs/Scotch] Verify SCOTCH module is loaded and matches rpm version (gnu16) |
|---|---|
| Outcome: | Passed |
| Duration: | 0.206 sec |
| Test case: | [libs/Scotch] Verify SCOTCH_DIR is defined and directory exists (gnu16) |
|---|---|
| Outcome: | Passed |
| Duration: | 0.021 sec |
| Test case: | [libs/Scotch] Verify module SCOTCH_LIB is defined and exists (gnu16) |
|---|---|
| Outcome: | Passed |
| Duration: | 0.02 sec |
| Test case: | [libs/Scotch] Verify dynamic library available in SCOTCH_LIB (gnu16) |
|---|---|
| Outcome: | Passed |
| Duration: | 0.019 sec |
| Test case: | [libs/Scotch] Verify static library is not present in SCOTCH_LIB (gnu16) |
|---|---|
| Outcome: | Passed |
| Duration: | 0.02 sec |
| Test case: | [libs/Scotch] Verify module SCOTCH_INC is defined and exists (gnu16) |
|---|---|
| Outcome: | Passed |
| Duration: | 0.02 sec |
| Test case: | [libs/Scotch] Verify header file is present in SCOTCH_INC (gnu16) |
|---|---|
| Outcome: | Passed |
| Duration: | 0.02 sec |
| Duration | 13.139 sec |
|---|---|
| Tests | 4 |
| Failures | 0 |
| Test case: | [libs/SLEPc] F90 SVD test binary runs under resource manager (slurm/gnu16/mpich) |
|---|---|
| Outcome: | Passed |
| Duration: | 6.443 sec |
| Test case: | [libs/SLEPc] C SVD of the Lauchli matrix binary runs under resource manager (slurm/gnu16/mpich) |
|---|---|
| Outcome: | Passed |
| Duration: | 2.23 sec |
| Duration | 0.279 sec |
|---|---|
| Tests | 7 |
| Failures | 0 |
| Test case: | [libs/slepc] Verify slepc module is loaded and matches rpm version (gnu16/mpich) |
|---|---|
| Outcome: | Passed |
| Duration: | 0.229 sec |
| Test case: | [libs/slepc] Verify module SLEPC_DIR is defined and exists (gnu16/mpich) |
|---|---|
| Outcome: | Passed |
| Duration: | 0.01 sec |
| Test case: | [libs/slepc] Verify module SLEPC_LIB is defined and exists (gnu16/mpich) |
|---|---|
| Outcome: | Passed |
| Duration: | 0.009 sec |
| Test case: | [libs/slepc] Verify dynamic library available in SLEPC_LIB (gnu16/mpich) |
|---|---|
| Outcome: | Passed |
| Duration: | 0.008 sec |
| Test case: | [libs/slepc] Verify static library is not present in SLEPC_LIB (gnu16/mpich) |
|---|---|
| Outcome: | Passed |
| Duration: | 0.007 sec |
| Duration | 13.145 sec |
|---|---|
| Tests | 4 |
| Failures | 0 |
| Test case: | [libs/SLEPc] F90 SVD test binary runs under resource manager (slurm/gnu16/openmpi5) |
|---|---|
| Outcome: | Passed |
| Duration: | 3.283 sec |
| Test case: | [libs/SLEPc] C SVD of the Lauchli matrix binary runs under resource manager (slurm/gnu16/openmpi5) |
|---|---|
| Outcome: | Passed |
| Duration: | 3.285 sec |
| Duration | 0.279 sec |
|---|---|
| Tests | 7 |
| Failures | 0 |
| Test case: | [libs/slepc] Verify slepc module is loaded and matches rpm version (gnu16/openmpi5) |
|---|---|
| Outcome: | Passed |
| Duration: | 0.233 sec |
| Test case: | [libs/slepc] Verify module SLEPC_DIR is defined and exists (gnu16/openmpi5) |
|---|---|
| Outcome: | Passed |
| Duration: | 0.009 sec |
| Test case: | [libs/slepc] Verify module SLEPC_LIB is defined and exists (gnu16/openmpi5) |
|---|---|
| Outcome: | Passed |
| Duration: | 0.008 sec |
| Test case: | [libs/slepc] Verify dynamic library available in SLEPC_LIB (gnu16/openmpi5) |
|---|---|
| Outcome: | Passed |
| Duration: | 0.007 sec |
| Test case: | [libs/slepc] Verify static library is not present in SLEPC_LIB (gnu16/openmpi5) |
|---|---|
| Outcome: | Passed |
| Duration: | 0.008 sec |
| Duration | 19.459 sec |
|---|---|
| Tests | 4 |
| Failures | 0 |
| Test case: | [libs/SLEPc] F90 SVD test binary runs under resource manager (slurm/gnu16/mvapich2) |
|---|---|
| Outcome: | Passed |
| Duration: | 12.769 sec |
| Test case: | [libs/SLEPc] C SVD of the Lauchli matrix binary runs under resource manager (slurm/gnu16/mvapich2) |
|---|---|
| Outcome: | Passed |
| Duration: | 1.176 sec |
| Duration | 0.283 sec |
|---|---|
| Tests | 7 |
| Failures | 0 |
| Test case: | [libs/slepc] Verify slepc module is loaded and matches rpm version (gnu16/mvapich2) |
|---|---|
| Outcome: | Passed |
| Duration: | 0.232 sec |
| Test case: | [libs/slepc] Verify module SLEPC_DIR is defined and exists (gnu16/mvapich2) |
|---|---|
| Outcome: | Passed |
| Duration: | 0.011 sec |
| Test case: | [libs/slepc] Verify module SLEPC_LIB is defined and exists (gnu16/mvapich2) |
|---|---|
| Outcome: | Passed |
| Duration: | 0.008 sec |
| Test case: | [libs/slepc] Verify dynamic library available in SLEPC_LIB (gnu16/mvapich2) |
|---|---|
| Outcome: | Passed |
| Duration: | 0.008 sec |
| Test case: | [libs/slepc] Verify static library is not present in SLEPC_LIB (gnu16/mvapich2) |
|---|---|
| Outcome: | Passed |
| Duration: | 0.008 sec |
| Duration | 0.336 sec |
|---|---|
| Tests | 7 |
| Failures | 0 |
| Test case: | [libs/SuperLU] Verify SUPERLU module is loaded and matches rpm version (gnu16) |
|---|---|
| Outcome: | Passed |
| Duration: | 0.217 sec |
| Test case: | [libs/SuperLU] Verify SUPERLU_DIR is defined and directory exists (gnu16) |
|---|---|
| Outcome: | Passed |
| Duration: | 0.02 sec |
| Test case: | [libs/SuperLU] Verify module SUPERLU_LIB is defined and exists (gnu16) |
|---|---|
| Outcome: | Passed |
| Duration: | 0.02 sec |
| Test case: | [libs/SuperLU] Verify dynamic library available in SUPERLU_LIB (gnu16) |
|---|---|
| Outcome: | Passed |
| Duration: | 0.019 sec |
| Test case: | [libs/SuperLU] Verify static library is not present in SUPERLU_LIB (gnu16) |
|---|---|
| Outcome: | Passed |
| Duration: | 0.021 sec |
| Duration | 163.437 sec |
|---|---|
| Tests | 9 |
| Failures | 0 |
| Test case: | [libs/SuperLU_DIST] PDGSSVX with full (default) options (slurm/gnu16/openmpi5) |
|---|---|
| Outcome: | Passed |
| Duration: | 8.554 sec |
| Test case: | [libs/SuperLU_DIST] pdgssvx_ABglobal with full (default) options (slurm/gnu16/openmpi5) |
|---|---|
| Outcome: | Passed |
| Duration: | 10.663 sec |
| Test case: | [libs/SuperLU_DIST] vary RHS ABglobal (slurm/gnu16/openmpi5) |
|---|---|
| Outcome: | Passed |
| Duration: | 14.887 sec |
| Test case: | [libs/SuperLU_DIST] reuse permutation vector (slurm/gnu16/openmpi5) |
|---|---|
| Outcome: | Passed |
| Duration: | 18.047 sec |
| Test case: | [libs/SuperLU_DIST] reuse permutation vector ABglobal (slurm/gnu16/openmpi5) |
|---|---|
| Outcome: | Passed |
| Duration: | 20.159 sec |
| Test case: | [libs/SuperLU_DIST] reuse symbolic factorization (slurm/gnu16/openmpi5) |
|---|---|
| Outcome: | Passed |
| Duration: | 22.261 sec |
| Duration | 0.364 sec |
|---|---|
| Tests | 7 |
| Failures | 0 |
| Test case: | [libs/SuperLU_DIST] Verify SUPERLU_DIST module is loaded and matches rpm version (gnu16/openmpi5) |
|---|---|
| Outcome: | Passed |
| Duration: | 0.238 sec |
| Test case: | [libs/SuperLU_DIST] Verify SUPERLU_DIST_DIR is defined and directory exists (gnu16/openmpi5) |
|---|---|
| Outcome: | Passed |
| Duration: | 0.021 sec |
| Test case: | [libs/SuperLU_DIST] Verify module SUPERLU_DIST_LIB is defined and exists (gnu16/openmpi5) |
|---|---|
| Outcome: | Passed |
| Duration: | 0.02 sec |
| Test case: | [libs/SuperLU_DIST] Verify dynamic library available in SUPERLU_DIST_LIB (gnu16/openmpi5) |
|---|---|
| Outcome: | Passed |
| Duration: | 0.021 sec |
| Test case: | [libs/SuperLU_DIST] Verify static library is not present in SUPERLU_DIST_LIB (gnu16/openmpi5) |
|---|---|
| Outcome: | Passed |
| Duration: | 0.021 sec |
| Duration | 31.643 sec |
|---|---|
| Tests | 9 |
| Failures | 0 |
| Test case: | [libs/SuperLU_DIST] PDGSSVX with full (default) options (slurm/gnu16/mvapich2) |
|---|---|
| Outcome: | Passed |
| Duration: | 1.176 sec |
| Test case: | [libs/SuperLU_DIST] pdgssvx_ABglobal with full (default) options (slurm/gnu16/mvapich2) |
|---|---|
| Outcome: | Passed |
| Duration: | 2.228 sec |
| Test case: | [libs/SuperLU_DIST] vary RHS ABglobal (slurm/gnu16/mvapich2) |
|---|---|
| Outcome: | Passed |
| Duration: | 3.282 sec |
| Test case: | [libs/SuperLU_DIST] reuse permutation vector (slurm/gnu16/mvapich2) |
|---|---|
| Outcome: | Passed |
| Duration: | 3.287 sec |
| Test case: | [libs/SuperLU_DIST] reuse permutation vector ABglobal (slurm/gnu16/mvapich2) |
|---|---|
| Outcome: | Passed |
| Duration: | 4.333 sec |
| Test case: | [libs/SuperLU_DIST] reuse symbolic factorization (slurm/gnu16/mvapich2) |
|---|---|
| Outcome: | Passed |
| Duration: | 4.333 sec |
| Duration | 0.352 sec |
|---|---|
| Tests | 7 |
| Failures | 0 |
| Test case: | [libs/SuperLU_DIST] Verify SUPERLU_DIST module is loaded and matches rpm version (gnu16/mvapich2) |
|---|---|
| Outcome: | Passed |
| Duration: | 0.228 sec |
| Test case: | [libs/SuperLU_DIST] Verify SUPERLU_DIST_DIR is defined and directory exists (gnu16/mvapich2) |
|---|---|
| Outcome: | Passed |
| Duration: | 0.019 sec |
| Test case: | [libs/SuperLU_DIST] Verify module SUPERLU_DIST_LIB is defined and exists (gnu16/mvapich2) |
|---|---|
| Outcome: | Passed |
| Duration: | 0.021 sec |
| Test case: | [libs/SuperLU_DIST] Verify dynamic library available in SUPERLU_DIST_LIB (gnu16/mvapich2) |
|---|---|
| Outcome: | Passed |
| Duration: | 0.021 sec |
| Test case: | [libs/SuperLU_DIST] Verify static library is not present in SUPERLU_DIST_LIB (gnu16/mvapich2) |
|---|---|
| Outcome: | Passed |
| Duration: | 0.021 sec |
| Duration | 27.412 sec |
|---|---|
| Tests | 9 |
| Failures | 0 |
| Test case: | [libs/SuperLU_DIST] PDGSSVX with full (default) options (slurm/gnu16/mpich) |
|---|---|
| Outcome: | Passed |
| Duration: | 1.174 sec |
| Test case: | [libs/SuperLU_DIST] pdgssvx_ABglobal with full (default) options (slurm/gnu16/mpich) |
|---|---|
| Outcome: | Passed |
| Duration: | 1.178 sec |
| Test case: | [libs/SuperLU_DIST] vary RHS ABglobal (slurm/gnu16/mpich) |
|---|---|
| Outcome: | Passed |
| Duration: | 2.224 sec |
| Test case: | [libs/SuperLU_DIST] reuse permutation vector (slurm/gnu16/mpich) |
|---|---|
| Outcome: | Passed |
| Duration: | 3.277 sec |
| Test case: | [libs/SuperLU_DIST] reuse permutation vector ABglobal (slurm/gnu16/mpich) |
|---|---|
| Outcome: | Passed |
| Duration: | 3.281 sec |
| Test case: | [libs/SuperLU_DIST] reuse symbolic factorization (slurm/gnu16/mpich) |
|---|---|
| Outcome: | Passed |
| Duration: | 4.333 sec |
| Duration | 0.366 sec |
|---|---|
| Tests | 7 |
| Failures | 0 |
| Test case: | [libs/SuperLU_DIST] Verify SUPERLU_DIST module is loaded and matches rpm version (gnu16/mpich) |
|---|---|
| Outcome: | Passed |
| Duration: | 0.241 sec |
| Test case: | [libs/SuperLU_DIST] Verify SUPERLU_DIST_DIR is defined and directory exists (gnu16/mpich) |
|---|---|
| Outcome: | Passed |
| Duration: | 0.021 sec |
| Test case: | [libs/SuperLU_DIST] Verify module SUPERLU_DIST_LIB is defined and exists (gnu16/mpich) |
|---|---|
| Outcome: | Passed |
| Duration: | 0.022 sec |
| Test case: | [libs/SuperLU_DIST] Verify dynamic library available in SUPERLU_DIST_LIB (gnu16/mpich) |
|---|---|
| Outcome: | Passed |
| Duration: | 0.021 sec |
| Test case: | [libs/SuperLU_DIST] Verify static library is not present in SUPERLU_DIST_LIB (gnu16/mpich) |
|---|---|
| Outcome: | Passed |
| Duration: | 0.02 sec |
| Duration | 18.62 sec |
|---|---|
| Tests | 6 |
| Failures | 0 |
| Test case: | [libs/Trilinos] Kokkos-MemorySpace runs under resource manager (slurm/gnu16/mpich) |
|---|---|
| Outcome: | Passed |
| Duration: | 2.225 sec |
| Test case: | [libs/Trilinos] Tpetra-InitMPI runs under resource manager (slurm/gnu16/mpich) |
|---|---|
| Outcome: | Passed |
| Duration: | 2.223 sec |
| Test case: | [libs/Trilinos] Tpetra-DataRedistribution runs under resource manager (slurm/gnu16/mpich) |
|---|---|
| Outcome: | Passed |
| Duration: | 3.276 sec |
| Test case: | [libs/Trilinos] Teuchos-ParameterList runs under resource manager (slurm/gnu16/mpich) |
|---|---|
| Outcome: | Passed |
| Duration: | 3.282 sec |
| Duration | 38.657 sec |
|---|---|
| Tests | 6 |
| Failures | 0 |
| Test case: | [libs/Trilinos] Kokkos-MemorySpace runs under resource manager (slurm/gnu16/openmpi5) |
|---|---|
| Outcome: | Passed |
| Duration: | 2.233 sec |
| Test case: | [libs/Trilinos] Tpetra-InitMPI runs under resource manager (slurm/gnu16/openmpi5) |
|---|---|
| Outcome: | Passed |
| Duration: | 4.333 sec |
| Test case: | [libs/Trilinos] Tpetra-DataRedistribution runs under resource manager (slurm/gnu16/openmpi5) |
|---|---|
| Outcome: | Passed |
| Duration: | 6.445 sec |
| Test case: | [libs/Trilinos] Teuchos-ParameterList runs under resource manager (slurm/gnu16/openmpi5) |
|---|---|
| Outcome: | Passed |
| Duration: | 7.492 sec |
| Duration | 40.736 sec |
|---|---|
| Tests | 6 |
| Failures | 0 |
| Test case: | [libs/Trilinos] Kokkos-MemorySpace runs under resource manager (slurm/gnu16/mvapich2) |
|---|---|
| Outcome: | Passed |
| Duration: | 1.178 sec |
| Test case: | [libs/Trilinos] Tpetra-InitMPI runs under resource manager (slurm/gnu16/mvapich2) |
|---|---|
| Outcome: | Passed |
| Duration: | 7.487 sec |
| Test case: | [libs/Trilinos] Tpetra-DataRedistribution runs under resource manager (slurm/gnu16/mvapich2) |
|---|---|
| Outcome: | Passed |
| Duration: | 7.488 sec |
| Test case: | [libs/Trilinos] Teuchos-ParameterList runs under resource manager (slurm/gnu16/mvapich2) |
|---|---|
| Outcome: | Passed |
| Duration: | 7.488 sec |
| Duration | 5.294 sec |
|---|---|
| Tests | 8 |
| Failures | 0 |
| Duration | 16.15 sec |
|---|---|
| Tests | 3 |
| Failures | 0 |
| Duration | 11.936 sec |
|---|---|
| Tests | 3 |
| Failures | 0 |
| Duration | 5.617 sec |
|---|---|
| Tests | 3 |
| Failures | 0 |
| Duration | 10.878 sec |
|---|---|
| Tests | 3 |
| Failures | 0 |
| Duration | 7.721 sec |
|---|---|
| Tests | 3 |
| Failures | 0 |
| Duration | 9.827 sec |
|---|---|
| Tests | 3 |
| Failures | 0 |
| Duration | 2.662 sec |
|---|---|
| Tests | 6 |
| Failures | 0 |
| Test case: | [perf-tools/Dimemas] Verify dimemas module is loaded and matches rpm version (gnu16/mpich) |
|---|---|
| Outcome: | Passed |
| Duration: | 0.219 sec |
| Test case: | [perf-tools/Dimemas] Verify DIMEMAS_DIR is defined and exists (gnu16/mpich) |
|---|---|
| Outcome: | Passed |
| Duration: | 0.019 sec |
| Test case: | [perf-tools/Dimemas] Verify DIMEMAS_BIN is defined and exists (gnu16/mpich) |
|---|---|
| Outcome: | Passed |
| Duration: | 0.017 sec |
| Test case: | [perf-tools/Dimemas] Verify availability of prv2dim binary (gnu16/mpich) |
|---|---|
| Outcome: | Passed |
| Duration: | 0.029 sec |
| Duration | 2.641 sec |
|---|---|
| Tests | 6 |
| Failures | 0 |
| Test case: | [perf-tools/Dimemas] Verify dimemas module is loaded and matches rpm version (gnu16/mvapich2) |
|---|---|
| Outcome: | Passed |
| Duration: | 0.236 sec |
| Test case: | [perf-tools/Dimemas] Verify DIMEMAS_DIR is defined and exists (gnu16/mvapich2) |
|---|---|
| Outcome: | Passed |
| Duration: | 0.02 sec |
| Test case: | [perf-tools/Dimemas] Verify DIMEMAS_BIN is defined and exists (gnu16/mvapich2) |
|---|---|
| Outcome: | Passed |
| Duration: | 0.021 sec |
| Test case: | [perf-tools/Dimemas] Verify availability of prv2dim binary (gnu16/mvapich2) |
|---|---|
| Outcome: | Passed |
| Duration: | 0.026 sec |
| Duration | 2.674 sec |
|---|---|
| Tests | 6 |
| Failures | 0 |
| Test case: | [perf-tools/Dimemas] Verify dimemas module is loaded and matches rpm version (gnu16/openmpi5) |
|---|---|
| Outcome: | Passed |
| Duration: | 0.229 sec |
| Test case: | [perf-tools/Dimemas] Verify DIMEMAS_DIR is defined and exists (gnu16/openmpi5) |
|---|---|
| Outcome: | Passed |
| Duration: | 0.021 sec |
| Test case: | [perf-tools/Dimemas] Verify DIMEMAS_BIN is defined and exists (gnu16/openmpi5) |
|---|---|
| Outcome: | Passed |
| Duration: | 0.021 sec |
| Test case: | [perf-tools/Dimemas] Verify availability of prv2dim binary (gnu16/openmpi5) |
|---|---|
| Outcome: | Passed |
| Duration: | 0.026 sec |
| Duration | 0.224 sec |
|---|---|
| Tests | 3 |
| Failures | 0 |
| Duration | 0.221 sec |
|---|---|
| Tests | 3 |
| Failures | 0 |
| Duration | 0.231 sec |
|---|---|
| Tests | 3 |
| Failures | 0 |
| Duration | 0.394 sec |
|---|---|
| Tests | 7 |
| Failures | 0 |
| Test case: | [OMB] Verify OMB module is loaded and matches rpm version (gnu16-mpich) |
|---|---|
| Outcome: | Passed |
| Duration: | 0.217 sec |
| Test case: | [OMB] Verify OMB_DIR is defined and directory exists (gnu16-mpich) |
|---|---|
| Outcome: | Passed |
| Duration: | 0.021 sec |
| Test case: | [OMB] Verify osu_latency binary is available (gnu16-mpich) |
|---|---|
| Outcome: | Passed |
| Duration: | 0.032 sec |
| Test case: | [OMB] Verify osu_allgather binary is available (gnu16-mpich) |
|---|---|
| Outcome: | Passed |
| Duration: | 0.03 sec |
| Duration | 0.391 sec |
|---|---|
| Tests | 7 |
| Failures | 0 |
| Test case: | [OMB] Verify OMB module is loaded and matches rpm version (gnu16-mvapich2) |
|---|---|
| Outcome: | Passed |
| Duration: | 0.213 sec |
| Test case: | [OMB] Verify OMB_DIR is defined and directory exists (gnu16-mvapich2) |
|---|---|
| Outcome: | Passed |
| Duration: | 0.021 sec |
| Test case: | [OMB] Verify osu_bw binary is available (gnu16-mvapich2) |
|---|---|
| Outcome: | Passed |
| Duration: | 0.031 sec |
| Test case: | [OMB] Verify osu_latency binary is available (gnu16-mvapich2) |
|---|---|
| Outcome: | Passed |
| Duration: | 0.033 sec |
| Test case: | [OMB] Verify osu_allgather binary is available (gnu16-mvapich2) |
|---|---|
| Outcome: | Passed |
| Duration: | 0.032 sec |
| Duration | 0.406 sec |
|---|---|
| Tests | 7 |
| Failures | 0 |
| Test case: | [OMB] Verify OMB module is loaded and matches rpm version (gnu16-openmpi5) |
|---|---|
| Outcome: | Passed |
| Duration: | 0.229 sec |
| Test case: | [OMB] Verify OMB_DIR is defined and directory exists (gnu16-openmpi5) |
|---|---|
| Outcome: | Passed |
| Duration: | 0.019 sec |
| Test case: | [OMB] Verify osu_bw binary is available (gnu16-openmpi5) |
|---|---|
| Outcome: | Passed |
| Duration: | 0.031 sec |
| Test case: | [OMB] Verify osu_latency binary is available (gnu16-openmpi5) |
|---|---|
| Outcome: | Passed |
| Duration: | 0.032 sec |
| Test case: | [OMB] Verify osu_allgather binary is available (gnu16-openmpi5) |
|---|---|
| Outcome: | Passed |
| Duration: | 0.032 sec |
| Duration | 1.569 sec |
|---|---|
| Tests | 3 |
| Failures | 0 |
| Duration | 0.41 sec |
|---|---|
| Tests | 9 |
| Failures | 0 |
| Test case: | [perf-tools/Paraver] Verify paraver module is loaded and matches rpm version |
|---|---|
| Outcome: | Passed |
| Duration: | 0.222 sec |
| Test case: | [perf-tools/Paraver] Verify PARAVER_DIR is defined and exists |
|---|---|
| Outcome: | Passed |
| Duration: | 0.02 sec |
| Test case: | [perf-tools/Paraver] Verify PARAVER_BIN is defined and exists |
|---|---|
| Outcome: | Passed |
| Duration: | 0.019 sec |
| Test case: | [perf-tools/Paraver] Verify availability of paramedir binary |
|---|---|
| Outcome: | Passed |
| Duration: | 0.026 sec |
| Test case: | [perf-tools/Paraver] Verify availability of wxparaver binary |
|---|---|
| Outcome: | Passed |
| Duration: | 0.027 sec |
| Test case: | [perf-tools/Paraver] Verify availability of prvstats binary |
|---|---|
| Outcome: | Passed |
| Duration: | 0.026 sec |
| Test case: | [perf-tools/Paraver] Verify availability of prvmerger binary |
|---|---|
| Outcome: | Passed |
| Duration: | 0.028 sec |
| Duration | 2.62 sec |
|---|---|
| Tests | 3 |
| Failures | 0 |
| Duration | 0.416 sec |
|---|---|
| Tests | 9 |
| Failures | 0 |
| Test case: | [perf-tools/Paraver] Verify paraver module is loaded and matches rpm version |
|---|---|
| Outcome: | Passed |
| Duration: | 0.229 sec |
| Test case: | [perf-tools/Paraver] Verify PARAVER_DIR is defined and exists |
|---|---|
| Outcome: | Passed |
| Duration: | 0.02 sec |
| Test case: | [perf-tools/Paraver] Verify PARAVER_BIN is defined and exists |
|---|---|
| Outcome: | Passed |
| Duration: | 0.021 sec |
| Test case: | [perf-tools/Paraver] Verify availability of paramedir binary |
|---|---|
| Outcome: | Passed |
| Duration: | 0.025 sec |
| Test case: | [perf-tools/Paraver] Verify availability of wxparaver binary |
|---|---|
| Outcome: | Passed |
| Duration: | 0.027 sec |
| Test case: | [perf-tools/Paraver] Verify availability of prvstats binary |
|---|---|
| Outcome: | Passed |
| Duration: | 0.027 sec |
| Test case: | [perf-tools/Paraver] Verify availability of prvmerger binary |
|---|---|
| Outcome: | Passed |
| Duration: | 0.027 sec |
| Duration | 8.959 sec |
|---|---|
| Tests | 3 |
| Failures | 0 |
| Duration | 0.419 sec |
|---|---|
| Tests | 9 |
| Failures | 0 |
| Test case: | [perf-tools/Paraver] Verify paraver module is loaded and matches rpm version |
|---|---|
| Outcome: | Passed |
| Duration: | 0.222 sec |
| Test case: | [perf-tools/Paraver] Verify PARAVER_DIR is defined and exists |
|---|---|
| Outcome: | Passed |
| Duration: | 0.021 sec |
| Test case: | [perf-tools/Paraver] Verify PARAVER_BIN is defined and exists |
|---|---|
| Outcome: | Passed |
| Duration: | 0.021 sec |
| Test case: | [perf-tools/Paraver] Verify availability of paramedir binary |
|---|---|
| Outcome: | Passed |
| Duration: | 0.028 sec |
| Test case: | [perf-tools/Paraver] Verify availability of wxparaver binary |
|---|---|
| Outcome: | Passed |
| Duration: | 0.027 sec |
| Test case: | [perf-tools/Paraver] Verify availability of prvstats binary |
|---|---|
| Outcome: | Passed |
| Duration: | 0.029 sec |
| Test case: | [perf-tools/Paraver] Verify availability of prvmerger binary |
|---|---|
| Outcome: | Passed |
| Duration: | 0.029 sec |
| Duration | 20.991 sec |
|---|---|
| Tests | 3 |
| Failures | 0 |
| Duration | 0.38 sec |
|---|---|
| Tests | 11 |
| Failures | 0 |
| Test case: | [perf-tools/Scalasca] Verify scalasca module is loaded and matches rpm version (gnu16/mpich) |
|---|---|
| Outcome: | Passed |
| Duration: | 0.228 sec |
| Test case: | [perf-tools/Scalasca] Verify module SCALASCA_DIR is defined and exists (gnu16/mpich) |
|---|---|
| Outcome: | Passed |
| Duration: | 0.007 sec |
| Test case: | [perf-tools/Scalasca] Verify module SCALASCA_BIN is defined and exists (gnu16/mpich) |
|---|---|
| Outcome: | Passed |
| Duration: | 0.008 sec |
| Test case: | [perf-tools/Scalasca] Verify availability of scalasca binary (gnu16/mpich) |
|---|---|
| Outcome: | Passed |
| Duration: | 0.018 sec |
| Test case: | [perf-tools/Scalasca] Verify availability of scan binary (gnu16/mpich) |
|---|---|
| Outcome: | Passed |
| Duration: | 0.018 sec |
| Test case: | [perf-tools/Scalasca] Verify availability of scout.mpi binary (gnu16/mpich) |
|---|---|
| Outcome: | Passed |
| Duration: | 0.015 sec |
| Test case: | [perf-tools/Scalasca] Verify availability of scout.omp binary (gnu16/mpich) |
|---|---|
| Outcome: | Passed |
| Duration: | 0.016 sec |
| Test case: | [perf-tools/Scalasca] Verify availability of scout.hyb binary (gnu16/mpich) |
|---|---|
| Outcome: | Passed |
| Duration: | 0.018 sec |
| Test case: | [perf-tools/Scalasca] Verify availability of scout.ser binary (gnu16/mpich) |
|---|---|
| Outcome: | Passed |
| Duration: | 0.017 sec |
| Duration | 19.92 sec |
|---|---|
| Tests | 3 |
| Failures | 0 |
| Duration | 0.367 sec |
|---|---|
| Tests | 11 |
| Failures | 0 |
| Test case: | [perf-tools/Scalasca] Verify scalasca module is loaded and matches rpm version (gnu16/mvapich2) |
|---|---|
| Outcome: | Passed |
| Duration: | 0.216 sec |
| Test case: | [perf-tools/Scalasca] Verify module SCALASCA_DIR is defined and exists (gnu16/mvapich2) |
|---|---|
| Outcome: | Passed |
| Duration: | 0.008 sec |
| Test case: | [perf-tools/Scalasca] Verify module SCALASCA_BIN is defined and exists (gnu16/mvapich2) |
|---|---|
| Outcome: | Passed |
| Duration: | 0.008 sec |
| Test case: | [perf-tools/Scalasca] Verify availability of scalasca binary (gnu16/mvapich2) |
|---|---|
| Outcome: | Passed |
| Duration: | 0.016 sec |
| Test case: | [perf-tools/Scalasca] Verify availability of scan binary (gnu16/mvapich2) |
|---|---|
| Outcome: | Passed |
| Duration: | 0.017 sec |
| Test case: | [perf-tools/Scalasca] Verify availability of scout.mpi binary (gnu16/mvapich2) |
|---|---|
| Outcome: | Passed |
| Duration: | 0.016 sec |
| Test case: | [perf-tools/Scalasca] Verify availability of scout.omp binary (gnu16/mvapich2) |
|---|---|
| Outcome: | Passed |
| Duration: | 0.017 sec |
| Test case: | [perf-tools/Scalasca] Verify availability of scout.hyb binary (gnu16/mvapich2) |
|---|---|
| Outcome: | Passed |
| Duration: | 0.016 sec |
| Test case: | [perf-tools/Scalasca] Verify availability of scout.ser binary (gnu16/mvapich2) |
|---|---|
| Outcome: | Passed |
| Duration: | 0.017 sec |
| Duration | 39.049 sec |
|---|---|
| Tests | 3 |
| Failures | 0 |
| Duration | 0.373 sec |
|---|---|
| Tests | 11 |
| Failures | 0 |
| Test case: | [perf-tools/Scalasca] Verify scalasca module is loaded and matches rpm version (gnu16/openmpi5) |
|---|---|
| Outcome: | Passed |
| Duration: | 0.227 sec |
| Test case: | [perf-tools/Scalasca] Verify module SCALASCA_DIR is defined and exists (gnu16/openmpi5) |
|---|---|
| Outcome: | Passed |
| Duration: | 0.008 sec |
| Test case: | [perf-tools/Scalasca] Verify module SCALASCA_BIN is defined and exists (gnu16/openmpi5) |
|---|---|
| Outcome: | Passed |
| Duration: | 0.007 sec |
| Test case: | [perf-tools/Scalasca] Verify availability of scalasca binary (gnu16/openmpi5) |
|---|---|
| Outcome: | Passed |
| Duration: | 0.017 sec |
| Test case: | [perf-tools/Scalasca] Verify availability of scan binary (gnu16/openmpi5) |
|---|---|
| Outcome: | Passed |
| Duration: | 0.017 sec |
| Test case: | [perf-tools/Scalasca] Verify availability of scout.mpi binary (gnu16/openmpi5) |
|---|---|
| Outcome: | Passed |
| Duration: | 0.016 sec |
| Test case: | [perf-tools/Scalasca] Verify availability of scout.omp binary (gnu16/openmpi5) |
|---|---|
| Outcome: | Passed |
| Duration: | 0.016 sec |
| Test case: | [perf-tools/Scalasca] Verify availability of scout.hyb binary (gnu16/openmpi5) |
|---|---|
| Outcome: | Passed |
| Duration: | 0.015 sec |
| Test case: | [perf-tools/Scalasca] Verify availability of scout.ser binary (gnu16/openmpi5) |
|---|---|
| Outcome: | Passed |
| Duration: | 0.015 sec |
| Duration | 2.322 sec |
|---|---|
| Tests | 9 |
| Failures | 0 |
| Test case: | [perf-tools/Score-P] MPI C binary includes expected Score-P instrumenter symbols (slurm/gnu16/mpich) |
|---|---|
| Outcome: | Passed |
| Duration: | 0.182 sec |
| Test case: | [perf-tools/Score-P] MPI C++ binary includes expected Score-P instrumenter symbols (slurm/gnu16/mpich) |
|---|---|
| Outcome: | Passed |
| Duration: | 0.186 sec |
| Test case: | [perf-tools/Score-P] MPI Fortran binary includes expected Score-P instrumenter symbols (slurm/gnu16/mpich) |
|---|---|
| Outcome: | Passed |
| Duration: | 0.181 sec |
| Test case: | [perf-tools/Score-P] Serial C OpenMP binary includes expected Score-P instrumenter symbols (slurm/gnu16/mpich) |
|---|---|
| Outcome: | Passed |
| Duration: | 0.207 sec |
| Test case: | [perf-tools/Score-P] Serial C++ OpenMP binary includes expected Score-P instrumenter symbols (slurm/gnu16/mpich) |
|---|---|
| Outcome: | Passed |
| Duration: | 0.213 sec |
| Test case: | [perf-tools/Score-P] Serial Fortran OpenMP binary includes expected Score-P instrumenter symbols (slurm/gnu16/mpich) |
|---|---|
| Outcome: | Passed |
| Duration: | 0.205 sec |
| Test case: | [perf-tools/Score-P] Hybrid (MPI+OpenMP) C binary includes expected Score-P instrumenter symbols (slurm/gnu16/mpich) |
|---|---|
| Outcome: | Passed |
| Duration: | 0.376 sec |
| Duration | 38.559 sec |
|---|---|
| Tests | 9 |
| Failures | 3 |
| Test case: | [perf-tools/Score-P] MPI C binary runs under resource manager (slurm/gnu16/mpich) |
|---|---|
| Outcome: | Passed |
| Duration: | 2.382 sec |
| Test case: | [perf-tools/Score-P] MPI C++ binary runs under resource manager (slurm/gnu16/mpich) |
|---|---|
| Outcome: | Passed |
| Duration: | 3.44 sec |
| Test case: | [perf-tools/Score-P] MPI Fortran binary runs under resource manager (slurm/gnu16/mpich) |
|---|---|
| Outcome: | Passed |
| Duration: | 4.879 sec |
| Test case: | [perf-tools/Score-P] Serial C OpenMP binary runs under resource manager (slurm/gnu16/mpich) |
|---|---|
| Outcome: | Failed |
| Duration: | 3.222 sec |
| Failed |
(from function `run_serial_binary' in file ./common/functions, line 287, in test file rm_execution, line 101) `run_serial_binary ./serial/main_omp_c' failed with status 239 srun: job 451 queued and waiting for resources srun: job 451 has been allocated resources srun: error: Task launch for StepId=451.0 failed on node c1: Protocol authentication error srun: error: Application launch failed: Protocol authentication error srun: Job step aborted
| Test case: | [perf-tools/Score-P] Serial C++ OpenMP binary runs under resource manager (slurm/gnu16/mpich) |
|---|---|
| Outcome: | Failed |
| Duration: | 3.143 sec |
| Failed |
(from function `run_serial_binary' in file ./common/functions, line 287, in test file rm_execution, line 115) `run_serial_binary ./serial/main_omp_cxx' failed with status 239 srun: job 452 queued and waiting for resources srun: job 452 has been allocated resources srun: error: Task launch for StepId=452.0 failed on node c2: Protocol authentication error srun: error: Application launch failed: Protocol authentication error srun: Job step aborted
| Test case: | [perf-tools/Score-P] Serial Fortran OpenMP binary runs under resource manager (slurm/gnu16/mpich) |
|---|---|
| Outcome: | Failed |
| Duration: | 3.201 sec |
| Failed |
(from function `run_serial_binary' in file ./common/functions, line 287, in test file rm_execution, line 129) `run_serial_binary ./serial/main_omp_fort' failed with status 239 srun: job 453 queued and waiting for resources srun: job 453 has been allocated resources srun: error: Task launch for StepId=453.0 failed on node c1: Protocol authentication error srun: error: Application launch failed: Protocol authentication error srun: Job step aborted
| Test case: | [perf-tools/Score-P] Hybrid (MPI+OpenMP) C binary runs under resource manager (slurm/gnu16/mpich) |
|---|---|
| Outcome: | Passed |
| Duration: | 4.521 sec |
| Duration | 0.738 sec |
|---|---|
| Tests | 14 |
| Failures | 0 |
| Test case: | [perf-tools/Score-P] Verify scorep module is loaded and matches rpm version (gnu16/mpich) |
|---|---|
| Outcome: | Passed |
| Duration: | 0.235 sec |
| Test case: | [perf-tools/Score-P] Verify module SCOREP_DIR is defined and exists (gnu16/mpich) |
|---|---|
| Outcome: | Passed |
| Duration: | 0.02 sec |
| Test case: | [perf-tools/Score-P] Verify module SCOREP_BIN is defined and exists (gnu16/mpich) |
|---|---|
| Outcome: | Passed |
| Duration: | 0.022 sec |
| Test case: | [perf-tools/Score-P] Verify availability of scorep binary (gnu16/mpich) |
|---|---|
| Outcome: | Passed |
| Duration: | 0.031 sec |
| Test case: | [perf-tools/Score-P] Verify availability of scorep-backend-info binary (gnu16/mpich) |
|---|---|
| Outcome: | Passed |
| Duration: | 0.032 sec |
| Test case: | [perf-tools/Score-P] Verify availability of scorep-config binary (gnu16/mpich) |
|---|---|
| Outcome: | Passed |
| Duration: | 0.032 sec |
| Test case: | [perf-tools/Score-P] Verify availability of scorep-info binary (gnu16/mpich) |
|---|---|
| Outcome: | Passed |
| Duration: | 0.033 sec |
| Test case: | [perf-tools/Score-P] Verify availability of scorep-preload-init binary (gnu16/mpich) |
|---|---|
| Outcome: | Passed |
| Duration: | 0.032 sec |
| Test case: | [perf-tools/Score-P] Verify availability of scorep-score binary (gnu16/mpich) |
|---|---|
| Outcome: | Passed |
| Duration: | 0.032 sec |
| Test case: | [perf-tools/Score-P] Verify availability of scorep-wrapper binary (gnu16/mpich) |
|---|---|
| Outcome: | Passed |
| Duration: | 0.033 sec |
| Test case: | [perf-tools/Score-P] Verify availability of scorep wrapper binaries (gnu16/mpich) |
|---|---|
| Outcome: | Passed |
| Duration: | 0.133 sec |
| Test case: | [perf-tools/Score-P] Verify availability of user guide for scorep (gnu16/mpich) |
|---|---|
| Outcome: | Passed |
| Duration: | 0.035 sec |
| Duration | 2.296 sec |
|---|---|
| Tests | 9 |
| Failures | 0 |
| Test case: | [perf-tools/Score-P] MPI C binary includes expected Score-P instrumenter symbols (slurm/gnu16/mvapich2) |
|---|---|
| Outcome: | Passed |
| Duration: | 0.178 sec |
| Test case: | [perf-tools/Score-P] MPI C++ binary includes expected Score-P instrumenter symbols (slurm/gnu16/mvapich2) |
|---|---|
| Outcome: | Passed |
| Duration: | 0.176 sec |
| Test case: | [perf-tools/Score-P] MPI Fortran binary includes expected Score-P instrumenter symbols (slurm/gnu16/mvapich2) |
|---|---|
| Outcome: | Passed |
| Duration: | 0.181 sec |
| Test case: | [perf-tools/Score-P] Serial C OpenMP binary includes expected Score-P instrumenter symbols (slurm/gnu16/mvapich2) |
|---|---|
| Outcome: | Passed |
| Duration: | 0.202 sec |
| Test case: | [perf-tools/Score-P] Serial C++ OpenMP binary includes expected Score-P instrumenter symbols (slurm/gnu16/mvapich2) |
|---|---|
| Outcome: | Passed |
| Duration: | 0.207 sec |
| Test case: | [perf-tools/Score-P] Serial Fortran OpenMP binary includes expected Score-P instrumenter symbols (slurm/gnu16/mvapich2) |
|---|---|
| Outcome: | Passed |
| Duration: | 0.208 sec |
| Test case: | [perf-tools/Score-P] Hybrid (MPI+OpenMP) C binary includes expected Score-P instrumenter symbols (slurm/gnu16/mvapich2) |
|---|---|
| Outcome: | Passed |
| Duration: | 0.374 sec |
| Duration | 35.023 sec |
|---|---|
| Tests | 9 |
| Failures | 3 |
| Test case: | [perf-tools/Score-P] MPI C binary runs under resource manager (slurm/gnu16/mvapich2) |
|---|---|
| Outcome: | Passed |
| Duration: | 2.374 sec |
| Test case: | [perf-tools/Score-P] MPI C++ binary runs under resource manager (slurm/gnu16/mvapich2) |
|---|---|
| Outcome: | Passed |
| Duration: | 2.376 sec |
| Test case: | [perf-tools/Score-P] MPI Fortran binary runs under resource manager (slurm/gnu16/mvapich2) |
|---|---|
| Outcome: | Passed |
| Duration: | 3.82 sec |
| Test case: | [perf-tools/Score-P] Serial C OpenMP binary runs under resource manager (slurm/gnu16/mvapich2) |
|---|---|
| Outcome: | Failed |
| Duration: | 2.78 sec |
| Failed |
(from function `run_serial_binary' in file ./common/functions, line 287, in test file rm_execution, line 101) `run_serial_binary ./serial/main_omp_c' failed with status 239 srun: job 460 queued and waiting for resources srun: job 460 has been allocated resources srun: error: Task launch for StepId=460.0 failed on node c1: Protocol authentication error srun: error: Application launch failed: Protocol authentication error srun: Job step aborted
| Test case: | [perf-tools/Score-P] Serial C++ OpenMP binary runs under resource manager (slurm/gnu16/mvapich2) |
|---|---|
| Outcome: | Failed |
| Duration: | 2.691 sec |
| Failed |
(from function `run_serial_binary' in file ./common/functions, line 287, in test file rm_execution, line 115) `run_serial_binary ./serial/main_omp_cxx' failed with status 239 srun: job 461 queued and waiting for resources srun: job 461 has been allocated resources srun: error: Task launch for StepId=461.0 failed on node c2: Protocol authentication error srun: error: Application launch failed: Protocol authentication error srun: Job step aborted
| Test case: | [perf-tools/Score-P] Serial Fortran OpenMP binary runs under resource manager (slurm/gnu16/mvapich2) |
|---|---|
| Outcome: | Failed |
| Duration: | 2.758 sec |
| Failed |
(from function `run_serial_binary' in file ./common/functions, line 287, in test file rm_execution, line 129) `run_serial_binary ./serial/main_omp_fort' failed with status 239 srun: job 462 queued and waiting for resources srun: job 462 has been allocated resources srun: error: Task launch for StepId=462.0 failed on node c1: Protocol authentication error srun: error: Application launch failed: Protocol authentication error srun: Job step aborted
| Test case: | [perf-tools/Score-P] Hybrid (MPI+OpenMP) C binary runs under resource manager (slurm/gnu16/mvapich2) |
|---|---|
| Outcome: | Passed |
| Duration: | 4.494 sec |
| Duration | 0.731 sec |
|---|---|
| Tests | 14 |
| Failures | 0 |
| Test case: | [perf-tools/Score-P] Verify scorep module is loaded and matches rpm version (gnu16/mvapich2) |
|---|---|
| Outcome: | Passed |
| Duration: | 0.235 sec |
| Test case: | [perf-tools/Score-P] Verify module SCOREP_DIR is defined and exists (gnu16/mvapich2) |
|---|---|
| Outcome: | Passed |
| Duration: | 0.021 sec |
| Test case: | [perf-tools/Score-P] Verify module SCOREP_BIN is defined and exists (gnu16/mvapich2) |
|---|---|
| Outcome: | Passed |
| Duration: | 0.018 sec |
| Test case: | [perf-tools/Score-P] Verify availability of scorep binary (gnu16/mvapich2) |
|---|---|
| Outcome: | Passed |
| Duration: | 0.032 sec |
| Test case: | [perf-tools/Score-P] Verify availability of scorep-backend-info binary (gnu16/mvapich2) |
|---|---|
| Outcome: | Passed |
| Duration: | 0.031 sec |
| Test case: | [perf-tools/Score-P] Verify availability of scorep-config binary (gnu16/mvapich2) |
|---|---|
| Outcome: | Passed |
| Duration: | 0.032 sec |
| Test case: | [perf-tools/Score-P] Verify availability of scorep-info binary (gnu16/mvapich2) |
|---|---|
| Outcome: | Passed |
| Duration: | 0.031 sec |
| Test case: | [perf-tools/Score-P] Verify availability of scorep-preload-init binary (gnu16/mvapich2) |
|---|---|
| Outcome: | Passed |
| Duration: | 0.032 sec |
| Test case: | [perf-tools/Score-P] Verify availability of scorep-score binary (gnu16/mvapich2) |
|---|---|
| Outcome: | Passed |
| Duration: | 0.032 sec |
| Test case: | [perf-tools/Score-P] Verify availability of scorep-wrapper binary (gnu16/mvapich2) |
|---|---|
| Outcome: | Passed |
| Duration: | 0.032 sec |
| Test case: | [perf-tools/Score-P] Verify availability of scorep wrapper binaries (gnu16/mvapich2) |
|---|---|
| Outcome: | Passed |
| Duration: | 0.135 sec |
| Test case: | [perf-tools/Score-P] Verify availability of user guide for scorep (gnu16/mvapich2) |
|---|---|
| Outcome: | Passed |
| Duration: | 0.034 sec |
| Duration | 2.417 sec |
|---|---|
| Tests | 9 |
| Failures | 0 |
| Test case: | [perf-tools/Score-P] MPI C binary includes expected Score-P instrumenter symbols (slurm/gnu16/openmpi5) |
|---|---|
| Outcome: | Passed |
| Duration: | 0.198 sec |
| Test case: | [perf-tools/Score-P] MPI C++ binary includes expected Score-P instrumenter symbols (slurm/gnu16/openmpi5) |
|---|---|
| Outcome: | Passed |
| Duration: | 0.195 sec |
| Test case: | [perf-tools/Score-P] MPI Fortran binary includes expected Score-P instrumenter symbols (slurm/gnu16/openmpi5) |
|---|---|
| Outcome: | Passed |
| Duration: | 0.187 sec |
| Test case: | [perf-tools/Score-P] Serial C OpenMP binary includes expected Score-P instrumenter symbols (slurm/gnu16/openmpi5) |
|---|---|
| Outcome: | Passed |
| Duration: | 0.2 sec |
| Test case: | [perf-tools/Score-P] Serial C++ OpenMP binary includes expected Score-P instrumenter symbols (slurm/gnu16/openmpi5) |
|---|---|
| Outcome: | Passed |
| Duration: | 0.215 sec |
| Test case: | [perf-tools/Score-P] Serial Fortran OpenMP binary includes expected Score-P instrumenter symbols (slurm/gnu16/openmpi5) |
|---|---|
| Outcome: | Passed |
| Duration: | 0.203 sec |
| Test case: | [perf-tools/Score-P] Hybrid (MPI+OpenMP) C binary includes expected Score-P instrumenter symbols (slurm/gnu16/openmpi5) |
|---|---|
| Outcome: | Passed |
| Duration: | 0.407 sec |
| Duration | 227.696 sec |
|---|---|
| Tests | 9 |
| Failures | 3 |
| Test case: | [perf-tools/Score-P] MPI C binary runs under resource manager (slurm/gnu16/openmpi5) |
|---|---|
| Outcome: | Passed |
| Duration: | 9.767 sec |
| Test case: | [perf-tools/Score-P] MPI C++ binary runs under resource manager (slurm/gnu16/openmpi5) |
|---|---|
| Outcome: | Passed |
| Duration: | 17.149 sec |
| Test case: | [perf-tools/Score-P] MPI Fortran binary runs under resource manager (slurm/gnu16/openmpi5) |
|---|---|
| Outcome: | Passed |
| Duration: | 24.909 sec |
| Test case: | [perf-tools/Score-P] Serial C OpenMP binary runs under resource manager (slurm/gnu16/openmpi5) |
|---|---|
| Outcome: | Failed |
| Duration: | 23.838 sec |
| Failed |
(from function `run_serial_binary' in file ./common/functions, line 287, in test file rm_execution, line 101) `run_serial_binary ./serial/main_omp_c' failed with status 239 srun: job 469 queued and waiting for resources srun: job 469 has been allocated resources srun: error: Task launch for StepId=469.0 failed on node c1: Protocol authentication error srun: error: Application launch failed: Protocol authentication error srun: Job step aborted
| Test case: | [perf-tools/Score-P] Serial C++ OpenMP binary runs under resource manager (slurm/gnu16/openmpi5) |
|---|---|
| Outcome: | Failed |
| Duration: | 23.743 sec |
| Failed |
(from function `run_serial_binary' in file ./common/functions, line 287, in test file rm_execution, line 115) `run_serial_binary ./serial/main_omp_cxx' failed with status 239 srun: job 470 queued and waiting for resources srun: job 470 has been allocated resources srun: error: Task launch for StepId=470.0 failed on node c2: Protocol authentication error srun: error: Application launch failed: Protocol authentication error srun: Job step aborted
| Test case: | [perf-tools/Score-P] Serial Fortran OpenMP binary runs under resource manager (slurm/gnu16/openmpi5) |
|---|---|
| Outcome: | Failed |
| Duration: | 23.803 sec |
| Failed |
(from function `run_serial_binary' in file ./common/functions, line 287, in test file rm_execution, line 129) `run_serial_binary ./serial/main_omp_fort' failed with status 239 srun: job 471 queued and waiting for resources srun: job 471 has been allocated resources srun: error: Task launch for StepId=471.0 failed on node c1: Protocol authentication error srun: error: Application launch failed: Protocol authentication error srun: Job step aborted
| Test case: | [perf-tools/Score-P] Hybrid (MPI+OpenMP) C binary runs under resource manager (slurm/gnu16/openmpi5) |
|---|---|
| Outcome: | Passed |
| Duration: | 31.946 sec |
| Duration | 0.778 sec |
|---|---|
| Tests | 14 |
| Failures | 0 |
| Test case: | [perf-tools/Score-P] Verify scorep module is loaded and matches rpm version (gnu16/openmpi5) |
|---|---|
| Outcome: | Passed |
| Duration: | 0.235 sec |
| Test case: | [perf-tools/Score-P] Verify module SCOREP_DIR is defined and exists (gnu16/openmpi5) |
|---|---|
| Outcome: | Passed |
| Duration: | 0.02 sec |
| Test case: | [perf-tools/Score-P] Verify module SCOREP_BIN is defined and exists (gnu16/openmpi5) |
|---|---|
| Outcome: | Passed |
| Duration: | 0.021 sec |
| Test case: | [perf-tools/Score-P] Verify availability of scorep binary (gnu16/openmpi5) |
|---|---|
| Outcome: | Passed |
| Duration: | 0.031 sec |
| Test case: | [perf-tools/Score-P] Verify availability of scorep-backend-info binary (gnu16/openmpi5) |
|---|---|
| Outcome: | Passed |
| Duration: | 0.032 sec |
| Test case: | [perf-tools/Score-P] Verify availability of scorep-config binary (gnu16/openmpi5) |
|---|---|
| Outcome: | Passed |
| Duration: | 0.033 sec |
| Test case: | [perf-tools/Score-P] Verify availability of scorep-info binary (gnu16/openmpi5) |
|---|---|
| Outcome: | Passed |
| Duration: | 0.033 sec |
| Test case: | [perf-tools/Score-P] Verify availability of scorep-preload-init binary (gnu16/openmpi5) |
|---|---|
| Outcome: | Passed |
| Duration: | 0.033 sec |
| Test case: | [perf-tools/Score-P] Verify availability of scorep-score binary (gnu16/openmpi5) |
|---|---|
| Outcome: | Passed |
| Duration: | 0.032 sec |
| Test case: | [perf-tools/Score-P] Verify availability of scorep-wrapper binary (gnu16/openmpi5) |
|---|---|
| Outcome: | Passed |
| Duration: | 0.033 sec |
| Test case: | [perf-tools/Score-P] Verify availability of scorep wrapper binaries (gnu16/openmpi5) |
|---|---|
| Outcome: | Passed |
| Duration: | 0.17 sec |
| Test case: | [perf-tools/Score-P] Verify availability of user guide for scorep (gnu16/openmpi5) |
|---|---|
| Outcome: | Passed |
| Duration: | 0.035 sec |
| Duration | 3.314 sec |
|---|---|
| Tests | 3 |
| Failures | 0 |
| Duration | 2.276 sec |
|---|---|
| Tests | 3 |
| Failures | 0 |
| Duration | 8.503 sec |
|---|---|
| Tests | 3 |
| Failures | 0 |
| Duration | 3.796 sec |
|---|---|
| Tests | 5 |
| Failures | 0 |
| Duration | 1.445 sec |
|---|---|
| Tests | 4 |
| Failures | 1 |
| Test case: | [pdsh] run a shell command on c[1-2] (slurm) |
|---|---|
| Outcome: | Failed |
| Duration: | 1.254 sec |
| Failed |
(from function `assert_success' in file ../common/test_helper_functions.bash, line 58, in test file pdsh, line 55) `assert_success' failed -- command failed -- status : 255 output (4 lines): c1: Host key verification failed. pdsh@ohpc-lenovo-sms: c1: ssh exited with exit code 255 c2: Host key verification failed. pdsh@ohpc-lenovo-sms: c2: ssh exited with exit code 255 --