Test Report : results

Test Suite: run

Results

Duration2.149 sec
Tests4
Failures0

Tests

run

Test case:[dev-tools/cmake] running cmake --system-information
Outcome:Passed
Duration:0.878 sec
Test case:[dev-tools/cmake] run cmake
Outcome:Passed
Duration:0.435 sec
Test case:[dev-tools/cmake] run make on generated Makefile
Outcome:Passed
Duration:0.826 sec
Test case:[dev-tools/cmake] run compiled binary
Outcome:Passed
Duration:0.01 sec

Test Suite: computes_installed.bats

Results

Duration2.83 sec
Tests5
Failures0

Tests

computes_installed.bats

Test case:num_computes is greater than zero
Outcome:Passed
Duration:0.019 sec
Test case:koomie_cf command is available
Outcome:Passed
Duration:0.02 sec
Test case:get uptime from compute nodes produces results
Outcome:Passed
Duration:1.093 sec
Test case:correct number of compute hosts respond
Outcome:Passed
Duration:0.59 sec
Test case:verify boot times are reasonable
Outcome:Passed
Duration:1.108 sec

Test Suite: sms_installed.bats

Results

Duration0.03 sec
Tests2
Failures0

Tests

sms_installed.bats

Test case:Verify hostname matches expectations
Outcome:Passed
Duration:0.013 sec
Test case:Base OS check
Outcome:Passed
Duration:0.017 sec

Test Suite: clustershell

Results

Duration1.094 sec
Tests2
Failures0

Tests

clustershell

Test case:[clush] check for OS-provided RPM
Outcome:Passed
Duration:0.05 sec
Test case:[clush] clush -Sg compute
Outcome:Passed
Duration:1.044 sec

Test Suite: conman

Results

Duration0.063 sec
Tests2
Failures0

Tests

conman

Test case:[conman] check for RPM
Outcome:Passed
Duration:0.045 sec
Test case:[conman] query conmand conman
Outcome:Passed
Duration:0.018 sec

Test Suite: genders

Results

Duration0.061 sec
Tests2
Failures0

Tests

genders

Test case:[genders] check for RPM
Outcome:Passed
Duration:0.044 sec
Test case:[genders] check node attributes
Outcome:Passed
Duration:0.017 sec

Test Suite: nhc

Results

Duration3.669 sec
Tests3
Failures0

Tests

nhc

Test case:[nhc] check for RPM
Outcome:Passed
Duration:0.046 sec
Test case:[nhc] generate config file
Outcome:Passed
Duration:1.214 sec
Test case:[nhc] service failure detection and restart
Outcome:Passed
Duration:2.409 sec

Test Suite: prun

Results

Duration0.111 sec
Tests5
Failures5

Tests

prun

Test case:[prun] unsupported MPI family exits non-zero
Outcome:Failed
Duration:0.024 sec
Failed
(in test file prun, line 14)
  `[[ "$output" == *"Unsupported or unknown MPI family"* ]]' failed
Test case:[prun] mpich with an unknown resource manager exits non-zero
Outcome:Failed
Duration:0.018 sec
Failed
(in test file prun, line 20)
  `[[ "$output" == *"Unknown resource manager"* ]]' failed
Test case:[prun] openmpi with an unknown resource manager exits non-zero
Outcome:Failed
Duration:0.018 sec
Failed
(in test file prun, line 26)
  `[[ "$output" == *"Unknown resource manager"* ]]' failed
Test case:[prun] mvapich2 with an unknown resource manager exits non-zero
Outcome:Failed
Duration:0.028 sec
Failed
(in test file prun, line 34)
  `[[ "$output" == *"Unknown resource manager"* ]]' failed
Test case:[prun] impi with an unknown resource manager exits non-zero
Outcome:Failed
Duration:0.023 sec
Failed
(in test file prun, line 40)
  `[[ "$output" == *"Unknown resource manager"* ]]' failed

Test Suite: slurm-plugins

Results

Duration1.507 sec
Tests4
Failures3

Tests

slurm-plugins

Test case:[slurm] check for jobcomp_elasticsearch plugin
Outcome:Failed
Duration:0.064 sec
Failed
(from function `assert_success' in file ./common/test_helper_functions.bash, line 58,
 in test file slurm-plugins, line 13)
  `assert_success' failed

-- command failed --
status : 2
output : ls: cannot access '/usr/lib64/slurm/jobcomp_elasticsearch.so': No such file or directory
--
Test case:[slurm] check for job_submit_lua plugin
Outcome:Failed
Duration:0.063 sec
Failed
(from function `assert_success' in file ./common/test_helper_functions.bash, line 58,
 in test file slurm-plugins, line 18)
  `assert_success' failed

-- command failed --
status : 2
output : ls: cannot access '/usr/lib64/slurm/job_submit_lua.so': No such file or directory
--
Test case:[slurm] check for --x11 option
Outcome:Failed
Duration:0.037 sec
Failed
(from function `assert_equal' in file ./common/test_helper_functions.bash, line 38,
 from function `assert_output' in file ./common/test_helper_functions.bash, line 49,
 in test file slurm-plugins, line 23)
  `assert_output "srun: error: No DISPLAY variable set, cannot setup x11 forwarding."' failed
output expected: srun: error: No DISPLAY variable set, cannot setup x11 forwarding.
output observed: /usr/lib/bats-core/test_functions.bash: line 166: srun: command not found
Test case:[slurm] check for sview rpm availability
Outcome:Passed
Duration:1.343 sec

Test Suite: lmod

Results

Duration0.43 sec
Tests1
Failures0

Tests

lmod

Test case:[lmod] test that the setup function passed
Outcome:Passed
Duration:0.43 sec

Test Suite: spack

Results

Duration29.284 sec
Tests4
Failures0

Tests

spack

Test case:[spack] check for RPM
Outcome:Passed
Duration:0.599 sec
Test case:[spack] add compiler
Outcome:Passed
Duration:11.347 sec
Test case:[spack] test build
Outcome:Passed
Duration:16.242 sec
Test case:[spack] test module refresh
Outcome:Passed
Duration:1.096 sec

Test Suite: build

Results

Duration6.82 sec
Tests1
Failures0

Tests

build

Test case:[/apps/hpcg] build HPCG executable (gnu16/mpich)
Outcome:Passed
Duration:6.82 sec

Test Suite: build

Results

Duration8.193 sec
Tests1
Failures0

Tests

build

Test case:[/apps/hpcg] build HPCG executable (gnu16/mvapich2)
Outcome:Passed
Duration:8.193 sec

Test Suite: build

Results

Duration0.065 sec
Tests1
Failures1

Tests

build

Test case:[/apps/hpcg] build HPCG executable (gnu16/openmpi5)
Outcome:Failed
Duration:0.065 sec
Failed
(in test file build, line 19)
  `make -f Makefile.ohpc -j 4' failed with status 2
rm -f src/*.o bin/xhpcg
mpicxx  -I./src -I./src/UNKNOWN  -DMPICH_IGNORE_CXX_SEEK -O3 -ffast-math -ftree-vectorize -ftree-vectorizer-verbose=0 -fopenmp   -c -o src/main.o src/main.cpp
mpicxx  -I./src -I./src/UNKNOWN  -DMPICH_IGNORE_CXX_SEEK -O3 -ffast-math -ftree-vectorize -ftree-vectorizer-verbose=0 -fopenmp   -c -o src/CG.o src/CG.cpp
mpicxx: error while loading shared libraries: libpmix.so.2: cannot open shared object file: No such file or directory
make[4]: *** [<builtin>: src/main.o] Error 127
mpicxx  -I./src -I./src/UNKNOWN  -DMPICH_IGNORE_CXX_SEEK -O3 -ffast-math -ftree-vectorize -ftree-vectorizer-verbose=0 -fopenmp   -c -o src/CG_ref.o src/CG_ref.cpp
mpicxx: error while loading shared libraries: libpmix.so.2: cannot open shared object file: No such file or directory
make[4]: *** [<builtin>: src/CG.o] Error 127
mpicxx  -I./src -I./src/UNKNOWN  -DMPICH_IGNORE_CXX_SEEK -O3 -ffast-math -ftree-vectorize -ftree-vectorizer-verbose=0 -fopenmp   -c -o src/TestCG.o src/TestCG.cpp
mpicxx: error while loading shared libraries: libpmix.so.2: cannot open shared object file: No such file or directory
make[4]: *** [<builtin>: src/CG_ref.o] Error 127
mpicxx  -I./src -I./src/UNKNOWN  -DMPICH_IGNORE_CXX_SEEK -O3 -ffast-math -ftree-vectorize -ftree-vectorizer-verbose=0 -fopenmp   -c -o src/ComputeResidual.o src/ComputeResidual.cpp
mpicxx: error while loading shared libraries: libpmix.so.2: cannot open shared object file: No such file or directory
make[4]: *** [<builtin>: src/TestCG.o] Error 127
mpicxx  -I./src -I./src/UNKNOWN  -DMPICH_IGNORE_CXX_SEEK -O3 -ffast-math -ftree-vectorize -ftree-vectorizer-verbose=0 -fopenmp   -c -o src/ExchangeHalo.o src/ExchangeHalo.cpp
mpicxx: error while loading shared libraries: libpmix.so.2: cannot open shared object file: No such file or directory
make[4]: *** [<builtin>: src/ComputeResidual.o] Error 127
mpicxx  -I./src -I./src/UNKNOWN  -DMPICH_IGNORE_CXX_SEEK -O3 -ffast-math -ftree-vectorize -ftree-vectorizer-verbose=0 -fopenmp   -c -o src/GenerateGeometry.o src/GenerateGeometry.cpp
mpicxx: error while loading shared libraries: libpmix.so.2: cannot open shared object file: No such file or directory
make[4]: *** [<builtin>: src/ExchangeHalo.o] Error 127
mpicxx  -I./src -I./src/UNKNOWN  -DMPICH_IGNORE_CXX_SEEK -O3 -ffast-math -ftree-vectorize -ftree-vectorizer-verbose=0 -fopenmp   -c -o src/GenerateProblem.o src/GenerateProblem.cpp
mpicxx: error while loading shared libraries: libpmix.so.2: cannot open shared object file: No such file or directory
make[4]: *** [<builtin>: src/GenerateGeometry.o] Error 127
mpicxx  -I./src -I./src/UNKNOWN  -DMPICH_IGNORE_CXX_SEEK -O3 -ffast-math -ftree-vectorize -ftree-vectorizer-verbose=0 -fopenmp   -c -o src/GenerateProblem_ref.o src/GenerateProblem_ref.cpp
mpicxx: error while loading shared libraries: libpmix.so.2: cannot open shared object file: No such file or directory
make[4]: *** [<builtin>: src/GenerateProblem.o] Error 127
mpicxx  -I./src -I./src/UNKNOWN  -DMPICH_IGNORE_CXX_SEEK -O3 -ffast-math -ftree-vectorize -ftree-vectorizer-verbose=0 -fopenmp   -c -o src/CheckProblem.o src/CheckProblem.cpp
mpicxx: error while loading shared libraries: libpmix.so.2: cannot open shared object file: No such file or directory
make[4]: *** [<builtin>: src/GenerateProblem_ref.o] Error 127
mpicxx  -I./src -I./src/UNKNOWN  -DMPICH_IGNORE_CXX_SEEK -O3 -ffast-math -ftree-vectorize -ftree-vectorizer-verbose=0 -fopenmp   -c -o src/MixedBaseCounter.o src/MixedBaseCounter.cpp
mpicxx: error while loading shared libraries: libpmix.so.2: cannot open shared object file: No such file or directory
make[4]: *** [<builtin>: src/CheckProblem.o] Error 127
mpicxx  -I./src -I./src/UNKNOWN  -DMPICH_IGNORE_CXX_SEEK -O3 -ffast-math -ftree-vectorize -ftree-vectorizer-verbose=0 -fopenmp   -c -o src/OptimizeProblem.o src/OptimizeProblem.cpp
mpicxx: error while loading shared libraries: libpmix.so.2: cannot open shared object file: No such file or directory
make[4]: *** [<builtin>: src/MixedBaseCounter.o] Error 127
mpicxx  -I./src -I./src/UNKNOWN  -DMPICH_IGNORE_CXX_SEEK -O3 -ffast-math -ftree-vectorize -ftree-vectorizer-verbose=0 -fopenmp   -c -o src/ReadHpcgDat.o src/ReadHpcgDat.cpp
mpicxx: error while loading shared libraries: libpmix.so.2: cannot open shared object file: No such file or directory
make[4]: *** [<builtin>: src/OptimizeProblem.o] Error 127
mpicxx  -I./src -I./src/UNKNOWN  -DMPICH_IGNORE_CXX_SEEK -O3 -ffast-math -ftree-vectorize -ftree-vectorizer-verbose=0 -fopenmp   -c -o src/ReportResults.o src/ReportResults.cpp
mpicxx: error while loading shared libraries: libpmix.so.2: cannot open shared object file: No such file or directory
make[4]: *** [<builtin>: src/ReadHpcgDat.o] Error 127
mpicxx  -I./src -I./src/UNKNOWN  -DMPICH_IGNORE_CXX_SEEK -O3 -ffast-math -ftree-vectorize -ftree-vectorizer-verbose=0 -fopenmp   -c -o src/SetupHalo.o src/SetupHalo.cpp
mpicxx: error while loading shared libraries: libpmix.so.2: cannot open shared object file: No such file or directory
make[4]: *** [<builtin>: src/ReportResults.o] Error 127
mpicxx  -I./src -I./src/UNKNOWN  -DMPICH_IGNORE_CXX_SEEK -O3 -ffast-math -ftree-vectorize -ftree-vectorizer-verbose=0 -fopenmp   -c -o src/SetupHalo_ref.o src/SetupHalo_ref.cpp
mpicxx: error while loading shared libraries: libpmix.so.2: cannot open shared object file: No such file or directory
make[4]: *** [<builtin>: src/SetupHalo.o] Error 127
mpicxx  -I./src -I./src/UNKNOWN  -DMPICH_IGNORE_CXX_SEEK -O3 -ffast-math -ftree-vectorize -ftree-vectorizer-verbose=0 -fopenmp   -c -o src/TestSymmetry.o src/TestSymmetry.cpp
mpicxx: error while loading shared libraries: libpmix.so.2: cannot open shared object file: No such file or directory
make[4]: *** [<builtin>: src/SetupHalo_ref.o] Error 127
mpicxx  -I./src -I./src/UNKNOWN  -DMPICH_IGNORE_CXX_SEEK -O3 -ffast-math -ftree-vectorize -ftree-vectorizer-verbose=0 -fopenmp   -c -o src/TestNorms.o src/TestNorms.cpp
mpicxx: error while loading shared libraries: libpmix.so.2: cannot open shared object file: No such file or directory
make[4]: *** [<builtin>: src/TestSymmetry.o] Error 127
mpicxx  -I./src -I./src/UNKNOWN  -DMPICH_IGNORE_CXX_SEEK -O3 -ffast-math -ftree-vectorize -ftree-vectorizer-verbose=0 -fopenmp   -c -o src/WriteProblem.o src/WriteProblem.cpp
mpicxx: error while loading shared libraries: libpmix.so.2: cannot open shared object file: No such file or directory
make[4]: *** [<builtin>: src/TestNorms.o] Error 127
mpicxx  -I./src -I./src/UNKNOWN  -DMPICH_IGNORE_CXX_SEEK -O3 -ffast-math -ftree-vectorize -ftree-vectorizer-verbose=0 -fopenmp   -c -o src/YAML_Doc.o src/YAML_Doc.cpp
mpicxx: error while loading shared libraries: libpmix.so.2: cannot open shared object file: No such file or directory
make[4]: *** [<builtin>: src/WriteProblem.o] Error 127
mpicxx  -I./src -I./src/UNKNOWN  -DMPICH_IGNORE_CXX_SEEK -O3 -ffast-math -ftree-vectorize -ftree-vectorizer-verbose=0 -fopenmp   -c -o src/YAML_Element.o src/YAML_Element.cpp
mpicxx: error while loading shared libraries: libpmix.so.2: cannot open shared object file: No such file or directory
make[4]: *** [<builtin>: src/YAML_Doc.o] Error 127
mpicxx  -I./src -I./src/UNKNOWN  -DMPICH_IGNORE_CXX_SEEK -O3 -ffast-math -ftree-vectorize -ftree-vectorizer-verbose=0 -fopenmp   -c -o src/ComputeDotProduct.o src/ComputeDotProduct.cpp
mpicxx: error while loading shared libraries: libpmix.so.2: cannot open shared object file: No such file or directory
make[4]: *** [<builtin>: src/YAML_Element.o] Error 127
mpicxx  -I./src -I./src/UNKNOWN  -DMPICH_IGNORE_CXX_SEEK -O3 -ffast-math -ftree-vectorize -ftree-vectorizer-verbose=0 -fopenmp   -c -o src/ComputeDotProduct_ref.o src/ComputeDotProduct_ref.cpp
mpicxx: error while loading shared libraries: libpmix.so.2: cannot open shared object file: No such file or directory
make[4]: *** [<builtin>: src/ComputeDotProduct.o] Error 127
mpicxx  -I./src -I./src/UNKNOWN  -DMPICH_IGNORE_CXX_SEEK -O3 -ffast-math -ftree-vectorize -ftree-vectorizer-verbose=0 -fopenmp   -c -o src/mytimer.o src/mytimer.cpp
mpicxx: error while loading shared libraries: libpmix.so.2: cannot open shared object file: No such file or directory
make[4]: *** [<builtin>: src/ComputeDotProduct_ref.o] Error 127
mpicxx  -I./src -I./src/UNKNOWN  -DMPICH_IGNORE_CXX_SEEK -O3 -ffast-math -ftree-vectorize -ftree-vectorizer-verbose=0 -fopenmp   -c -o src/ComputeOptimalShapeXYZ.o src/ComputeOptimalShapeXYZ.cpp
mpicxx: error while loading shared libraries: libpmix.so.2: cannot open shared object file: No such file or directory
make[4]: *** [<builtin>: src/mytimer.o] Error 127
mpicxx  -I./src -I./src/UNKNOWN  -DMPICH_IGNORE_CXX_SEEK -O3 -ffast-math -ftree-vectorize -ftree-vectorizer-verbose=0 -fopenmp   -c -o src/ComputeSPMV.o src/ComputeSPMV.cpp
mpicxx: error while loading shared libraries: libpmix.so.2: cannot open shared object file: No such file or directory
make[4]: *** [<builtin>: src/ComputeOptimalShapeXYZ.o] Error 127
mpicxx  -I./src -I./src/UNKNOWN  -DMPICH_IGNORE_CXX_SEEK -O3 -ffast-math -ftree-vectorize -ftree-vectorizer-verbose=0 -fopenmp   -c -o src/ComputeSPMV_ref.o src/ComputeSPMV_ref.cpp
mpicxx: error while loading shared libraries: libpmix.so.2: cannot open shared object file: No such file or directory
make[4]: *** [<builtin>: src/ComputeSPMV.o] Error 127
mpicxx  -I./src -I./src/UNKNOWN  -DMPICH_IGNORE_CXX_SEEK -O3 -ffast-math -ftree-vectorize -ftree-vectorizer-verbose=0 -fopenmp   -c -o src/ComputeSYMGS.o src/ComputeSYMGS.cpp
mpicxx: error while loading shared libraries: libpmix.so.2: cannot open shared object file: No such file or directory
make[4]: *** [<builtin>: src/ComputeSPMV_ref.o] Error 127
mpicxx  -I./src -I./src/UNKNOWN  -DMPICH_IGNORE_CXX_SEEK -O3 -ffast-math -ftree-vectorize -ftree-vectorizer-verbose=0 -fopenmp   -c -o src/ComputeSYMGS_ref.o src/ComputeSYMGS_ref.cpp
mpicxx: error while loading shared libraries: libpmix.so.2: cannot open shared object file: No such file or directory
make[4]: *** [<builtin>: src/ComputeSYMGS.o] Error 127
mpicxx  -I./src -I./src/UNKNOWN  -DMPICH_IGNORE_CXX_SEEK -O3 -ffast-math -ftree-vectorize -ftree-vectorizer-verbose=0 -fopenmp   -c -o src/ComputeWAXPBY.o src/ComputeWAXPBY.cpp
mpicxx: error while loading shared libraries: libpmix.so.2: cannot open shared object file: No such file or directory
make[4]: *** [<builtin>: src/ComputeSYMGS_ref.o] Error 127
mpicxx  -I./src -I./src/UNKNOWN  -DMPICH_IGNORE_CXX_SEEK -O3 -ffast-math -ftree-vectorize -ftree-vectorizer-verbose=0 -fopenmp   -c -o src/ComputeWAXPBY_ref.o src/ComputeWAXPBY_ref.cpp
mpicxx: error while loading shared libraries: libpmix.so.2: cannot open shared object file: No such file or directory
make[4]: *** [<builtin>: src/ComputeWAXPBY.o] Error 127
mpicxx  -I./src -I./src/UNKNOWN  -DMPICH_IGNORE_CXX_SEEK -O3 -ffast-math -ftree-vectorize -ftree-vectorizer-verbose=0 -fopenmp   -c -o src/ComputeMG_ref.o src/ComputeMG_ref.cpp
mpicxx: error while loading shared libraries: libpmix.so.2: cannot open shared object file: No such file or directory
make[4]: *** [<builtin>: src/ComputeWAXPBY_ref.o] Error 127
mpicxx  -I./src -I./src/UNKNOWN  -DMPICH_IGNORE_CXX_SEEK -O3 -ffast-math -ftree-vectorize -ftree-vectorizer-verbose=0 -fopenmp   -c -o src/ComputeMG.o src/ComputeMG.cpp
mpicxx: error while loading shared libraries: libpmix.so.2: cannot open shared object file: No such file or directory
make[4]: *** [<builtin>: src/ComputeMG_ref.o] Error 127
mpicxx  -I./src -I./src/UNKNOWN  -DMPICH_IGNORE_CXX_SEEK -O3 -ffast-math -ftree-vectorize -ftree-vectorizer-verbose=0 -fopenmp   -c -o src/ComputeProlongation_ref.o src/ComputeProlongation_ref.cpp
mpicxx: error while loading shared libraries: libpmix.so.2: cannot open shared object file: No such file or directory
make[4]: *** [<builtin>: src/ComputeMG.o] Error 127
mpicxx  -I./src -I./src/UNKNOWN  -DMPICH_IGNORE_CXX_SEEK -O3 -ffast-math -ftree-vectorize -ftree-vectorizer-verbose=0 -fopenmp   -c -o src/ComputeRestriction_ref.o src/ComputeRestriction_ref.cpp
mpicxx: error while loading shared libraries: libpmix.so.2: cannot open shared object file: No such file or directory
make[4]: *** [<builtin>: src/ComputeProlongation_ref.o] Error 127
mpicxx  -I./src -I./src/UNKNOWN  -DMPICH_IGNORE_CXX_SEEK -O3 -ffast-math -ftree-vectorize -ftree-vectorizer-verbose=0 -fopenmp   -c -o src/CheckAspectRatio.o src/CheckAspectRatio.cpp
mpicxx: error while loading shared libraries: libpmix.so.2: cannot open shared object file: No such file or directory
make[4]: *** [<builtin>: src/ComputeRestriction_ref.o] Error 127
mpicxx  -I./src -I./src/UNKNOWN  -DMPICH_IGNORE_CXX_SEEK -O3 -ffast-math -ftree-vectorize -ftree-vectorizer-verbose=0 -fopenmp   -c -o src/GenerateCoarseProblem.o src/GenerateCoarseProblem.cpp
mpicxx: error while loading shared libraries: libpmix.so.2: cannot open shared object file: No such file or directory
make[4]: *** [<builtin>: src/CheckAspectRatio.o] Error 127
mpicxx  -I./src -I./src/UNKNOWN  -DMPICH_IGNORE_CXX_SEEK -O3 -ffast-math -ftree-vectorize -ftree-vectorizer-verbose=0 -fopenmp   -c -o src/init.o src/init.cpp
mpicxx: error while loading shared libraries: libpmix.so.2: cannot open shared object file: No such file or directory
make[4]: *** [<builtin>: src/GenerateCoarseProblem.o] Error 127
mpicxx  -I./src -I./src/UNKNOWN  -DMPICH_IGNORE_CXX_SEEK -O3 -ffast-math -ftree-vectorize -ftree-vectorizer-verbose=0 -fopenmp   -c -o src/finalize.o src/finalize.cpp
mpicxx: error while loading shared libraries: libpmix.so.2: cannot open shared object file: No such file or directory
make[4]: *** [<builtin>: src/init.o] Error 127
mpicxx: error while loading shared libraries: libpmix.so.2: cannot open shared object file: No such file or directory
make[4]: *** [<builtin>: src/finalize.o] Error 127
make[4]: Target 'all' not remade because of errors.

Test Suite: build

Results

Duration9.896 sec
Tests1
Failures0

Tests

build

Test case:[Apps/miniFE] build MiniFE executable (gnu16/mpich)
Outcome:Passed
Duration:9.896 sec

Test Suite: build

Results

Duration14.185 sec
Tests1
Failures0

Tests

build

Test case:[Apps/miniFE] build MiniFE executable (gnu16/mvapich2)
Outcome:Passed
Duration:14.185 sec

Test Suite: os_distribution

Results

Duration0.008 sec
Tests1
Failures0

Tests

os_distribution

Test case:[BOS] OS distribution matches (local)
Outcome:Passed
Duration:0.008 sec

Test Suite: computes

Results

Duration4.366 sec
Tests4
Failures0

Tests

computes

Test case:[BOS] OS distribution matches (2 active computes)
Outcome:Skipped
Duration:0.0 sec
Skipped
disable BOS_RELEASE check
Test case:[BOS] consistent kernel (2 active computes)
Outcome:Passed
Duration:1.095 sec
Test case:[BOS] increased locked memory limits
Outcome:Passed
Duration:2.179 sec
Test case:[BOS] syslog forwarding
Outcome:Passed
Duration:1.092 sec

Test Suite: debugger

Results

Duration0.016 sec
Tests2
Failures0

Tests

debugger

Test case:[Compilers] debugger man page (gnu16)
Outcome:Passed
Duration:0.009 sec
Test case:[Compilers] debugger availability (gnu16)
Outcome:Passed
Duration:0.007 sec

Test Suite: man_pages

Results

Duration0.129 sec
Tests3
Failures0

Tests

man_pages

Test case:[Compilers] C compiler man/help page (gnu16)
Outcome:Passed
Duration:0.042 sec
Test case:[Compilers] C++ compiler man/help page (gnu16)
Outcome:Passed
Duration:0.048 sec
Test case:[Compilers] Fortran compiler man/help page (gnu16)
Outcome:Passed
Duration:0.039 sec

Test Suite: rm_execution

Results

Duration0.0 sec
Tests1
Failures1

Tests

rm_execution

Test case:
Outcome:Failed
Duration:0.0 sec
Failed
(from function `ERROR' in file ./common/functions, line 11,
 from function `check_rms' in file ./common/functions, line 35,
 from function `setup_file' in test file rm_execution, line 13)
  `check_rms' failed with status 0
[OHPC-TEST:ERROR]: Unsupported or unknown resource manager

Test Suite: version_match

Results

Duration0.448 sec
Tests3
Failures0

Tests

version_match

Test case:[Compilers] compiler module loaded (gnu16)
Outcome:Passed
Duration:0.133 sec
Test case:[Compilers] compiler module version available (gnu16)
Outcome:Passed
Duration:0.13 sec
Test case:[Compilers] C, C++, and Fortran versions match module (gnu16)
Outcome:Passed
Duration:0.185 sec

Test Suite: EasyBuild

Results

Duration545.125 sec
Tests3
Failures0

Tests

EasyBuild

Test case:[EasyBuild] check for RPM
Outcome:Passed
Duration:0.233 sec
Test case:[EasyBuild] test executable
Outcome:Passed
Duration:2.223 sec
Test case:[EasyBuild] test install of tmux
Outcome:Passed
Duration:542.669 sec

Test Suite: test_module

Results

Duration0.24 sec
Tests7
Failures0

Tests

test_module

Test case:[HWLOC] Verify HWLOC module is loaded and matches rpm version (gnu16/)
Outcome:Passed
Duration:0.184 sec
Test case:[HWLOC] Verify module HWLOC_DIR is defined and exists (gnu16/)
Outcome:Passed
Duration:0.011 sec
Test case:[HWLOC] Verify module HWLOC_LIB is defined and exists (gnu16/)
Outcome:Passed
Duration:0.009 sec
Test case:[HWLOC] Verify dynamic library available in HWLOC_LIB (gnu16/)
Outcome:Passed
Duration:0.009 sec
Test case:[HWLOC] Verify static library is not present in HWLOC_LIB (gnu16/)
Outcome:Passed
Duration:0.009 sec
Test case:[HWLOC] Verify module HWLOC_INC is defined and exists (gnu16/)
Outcome:Passed
Duration:0.009 sec
Test case:[HWLOC] Verify header file is present in HWLOC_INC (gnu16/)
Outcome:Passed
Duration:0.009 sec

Test Suite: test_module

Results

Duration0.027 sec
Tests3
Failures0

Tests

test_module

Test case:[mpi4py] Verify module is loaded and matches rpm version (gnu16/mpich)
Outcome:Passed
Duration:0.008 sec
Test case:[mpi4py] Verify module MPI4PY_DIR is defined and exists (gnu16/mpich)
Outcome:Passed
Duration:0.011 sec
Test case:[mpi4py] Verify PYTHONPATH is defined and exists (gnu16/mpich)
Outcome:Passed
Duration:0.008 sec

Test Suite: test_module

Results

Duration0.027 sec
Tests3
Failures0

Tests

test_module

Test case:[mpi4py] Verify module is loaded and matches rpm version (gnu16/mvapich2)
Outcome:Passed
Duration:0.008 sec
Test case:[mpi4py] Verify module MPI4PY_DIR is defined and exists (gnu16/mvapich2)
Outcome:Passed
Duration:0.011 sec
Test case:[mpi4py] Verify PYTHONPATH is defined and exists (gnu16/mvapich2)
Outcome:Passed
Duration:0.008 sec

Test Suite: test_module

Results

Duration0.029 sec
Tests3
Failures0

Tests

test_module

Test case:[mpi4py] Verify module is loaded and matches rpm version (gnu16/openmpi5)
Outcome:Passed
Duration:0.009 sec
Test case:[mpi4py] Verify module MPI4PY_DIR is defined and exists (gnu16/openmpi5)
Outcome:Passed
Duration:0.011 sec
Test case:[mpi4py] Verify PYTHONPATH is defined and exists (gnu16/openmpi5)
Outcome:Passed
Duration:0.009 sec

Test Suite: rm_execution

Results

Duration0.0 sec
Tests1
Failures1

Tests

rm_execution

Test case:
Outcome:Failed
Duration:0.0 sec
Failed
(from function `ERROR' in file ../../../common/functions, line 11,
 from function `check_rms' in file ../../../common/functions, line 35,
 from function `setup_file' in test file rm_execution, line 12)
  `check_rms' failed with status 0
[OHPC-TEST:ERROR]: Unsupported or unknown resource manager

Test Suite: test_module

Results

Duration0.269 sec
Tests4
Failures0

Tests

test_module

Test case:[dev-tools/py3-numpy] Verify py3-numpy module is loaded and matches rpm version (gnu16)
Outcome:Passed
Duration:0.209 sec
Test case:[dev-tools/py3-numpy] Verify NUMPY_DIR is defined and directory exists (gnu16)
Outcome:Passed
Duration:0.02 sec
Test case:[dev-tools/py3-numpy] Verify NUMPY_BIN is defined and directory exists (gnu16)
Outcome:Passed
Duration:0.02 sec
Test case:[dev-tools/py3-numpy] Verify PYTHONPATH is defined (gnu16)
Outcome:Passed
Duration:0.02 sec

Test Suite: rm_execution

Results

Duration0.0 sec
Tests1
Failures1

Tests

rm_execution

Test case:
Outcome:Failed
Duration:0.0 sec
Failed
(from function `ERROR' in file ../../../common/functions, line 11,
 from function `check_rms' in file ../../../common/functions, line 35,
 from function `setup_file' in test file rm_execution, line 12)
  `check_rms' failed with status 0
[OHPC-TEST:ERROR]: Unsupported or unknown resource manager

Test Suite: test_module

Results

Duration1.495 sec
Tests8
Failures0

Tests

test_module

Test case:[dev-tools/Valgrind] Verify valgrind module is loaded and matches rpm version (gnu16)
Outcome:Passed
Duration:0.21 sec
Test case:[dev-tools/Valgrind] Verify VALGRIND_DIR is defined and directory exists (gnu16)
Outcome:Passed
Duration:0.018 sec
Test case:[dev-tools/Valgrind] Verify availability of valgrind binary (gnu16)
Outcome:Passed
Duration:0.029 sec
Test case:[dev-tools/Valgrind] Verify availability of man page (gnu16)
Outcome:Passed
Duration:0.056 sec
Test case:[dev-tools/Valgrind] Verify module VALGRIND_INC is defined and exists (gnu16)
Outcome:Passed
Duration:0.019 sec
Test case:[dev-tools/Valgrind] Verify header file is present in VALGRIND_INC (gnu16)
Outcome:Passed
Duration:0.019 sec
Test case:[dev-tools/Valgrind] Callgrind test (gnu16)
Outcome:Passed
Duration:0.256 sec
Test case:[dev-tools/Valgrind] Memcheck test (gnu16)
Outcome:Passed
Duration:0.888 sec

Test Suite: test_module

Results

Duration12.677 sec
Tests7
Failures0

Tests

test_module

Test case:[R] Verify R module is loaded and matches rpm version (gnu16)
Outcome:Passed
Duration:0.226 sec
Test case:[R] Verify R_DIR is defined and exists (gnu16)
Outcome:Passed
Duration:0.01 sec
Test case:[R] Verify availability of R executable -> R (gnu16)
Outcome:Passed
Duration:0.017 sec
Test case:[R] Verify availability of R executable -> Rscript (gnu16)
Outcome:Passed
Duration:0.017 sec
Test case:[R] Verify module R_SHARE is defined and exists (gnu16)
Outcome:Passed
Duration:0.01 sec
Test case:[R] Running bench.R test
Outcome:Passed
Duration:11.84 sec
Test case:[R] Verify ability to compile C code for R and execute
Outcome:Passed
Duration:0.557 sec

Test Suite: rm_execution

Results

Duration0.0 sec
Tests1
Failures1

Tests

rm_execution

Test case:
Outcome:Failed
Duration:0.0 sec
Failed
(from function `ERROR' in file ../../../common/functions, line 11,
 from function `check_rms' in file ../../../common/functions, line 35,
 from function `setup_file' in test file rm_execution, line 12)
  `check_rms' failed with status 0
[OHPC-TEST:ERROR]: Unsupported or unknown resource manager

Test Suite: test_module

Results

Duration0.359 sec
Tests7
Failures0

Tests

test_module

Test case:[libs/adios2] Verify ADIOS2 module is loaded and matches rpm version (gnu16/mpich)
Outcome:Passed
Duration:0.234 sec
Test case:[libs/adios2] Verify module ADIOS2_DIR is defined and exists (gnu16/mpich)
Outcome:Passed
Duration:0.02 sec
Test case:[libs/adios2] Verify module ADIOS2_BIN is defined and exists (gnu16/mpich)
Outcome:Passed
Duration:0.018 sec
Test case:[libs/adios2] Verify module ADIOS2_LIB is defined and exists (gnu16/mpich)
Outcome:Passed
Duration:0.021 sec
Test case:[libs/adios2] Verify dynamic library available in ADIOS2_LIB (gnu16/mpich)
Outcome:Passed
Duration:0.026 sec
Test case:[libs/adios2] Verify module ADIOS2_INC is defined and exists (gnu16/mpich)
Outcome:Passed
Duration:0.021 sec
Test case:[libs/adios2] Verify header file is present in ADIOS2_INC (gnu16/mpich)
Outcome:Passed
Duration:0.019 sec

Test Suite: rm_execution

Results

Duration0.0 sec
Tests1
Failures1

Tests

rm_execution

Test case:
Outcome:Failed
Duration:0.0 sec
Failed
(from function `ERROR' in file ../../../common/functions, line 11,
 from function `check_rms' in file ../../../common/functions, line 35,
 from function `setup_file' in test file rm_execution, line 12)
  `check_rms' failed with status 0
[OHPC-TEST:ERROR]: Unsupported or unknown resource manager

Test Suite: test_module

Results

Duration0.355 sec
Tests7
Failures0

Tests

test_module

Test case:[libs/adios2] Verify ADIOS2 module is loaded and matches rpm version (gnu16/mvapich2)
Outcome:Passed
Duration:0.229 sec
Test case:[libs/adios2] Verify module ADIOS2_DIR is defined and exists (gnu16/mvapich2)
Outcome:Passed
Duration:0.021 sec
Test case:[libs/adios2] Verify module ADIOS2_BIN is defined and exists (gnu16/mvapich2)
Outcome:Passed
Duration:0.02 sec
Test case:[libs/adios2] Verify module ADIOS2_LIB is defined and exists (gnu16/mvapich2)
Outcome:Passed
Duration:0.018 sec
Test case:[libs/adios2] Verify dynamic library available in ADIOS2_LIB (gnu16/mvapich2)
Outcome:Passed
Duration:0.025 sec
Test case:[libs/adios2] Verify module ADIOS2_INC is defined and exists (gnu16/mvapich2)
Outcome:Passed
Duration:0.021 sec
Test case:[libs/adios2] Verify header file is present in ADIOS2_INC (gnu16/mvapich2)
Outcome:Passed
Duration:0.021 sec

Test Suite: test_module

Results

Duration2.962 sec
Tests8
Failures0

Tests

test_module

Test case:[BOOST] Verify BOOST module is loaded and matches rpm version (gnu16/mpich)
Outcome:Passed
Duration:0.226 sec
Test case:[BOOST] Verify module BOOST_DIR is defined and exists (gnu16/mpich)
Outcome:Passed
Duration:0.011 sec
Test case:[BOOST] Verify module BOOST_LIB is defined and exists (gnu16/mpich)
Outcome:Passed
Duration:0.008 sec
Test case:[BOOST] Verify dynamic library available in BOOST_LIB (gnu16/mpich)
Outcome:Passed
Duration:0.009 sec
Test case:[BOOST] Verify static library is not present in BOOST_LIB (gnu16/mpich)
Outcome:Passed
Duration:0.009 sec
Test case:[BOOST] Verify module BOOST_INC is defined and exists (gnu16/mpich)
Outcome:Passed
Duration:0.008 sec
Test case:[BOOST] Verify header file is present in BOOST_INC (gnu16/mpich)
Outcome:Passed
Duration:0.01 sec
Test case:[BOOST] Test interactive build/exec of f_test.cpp (gnu16/mpich)
Outcome:Passed
Duration:2.681 sec

Test Suite: test_module

Results

Duration2.93 sec
Tests8
Failures0

Tests

test_module

Test case:[BOOST] Verify BOOST module is loaded and matches rpm version (gnu16/mvapich2)
Outcome:Passed
Duration:0.227 sec
Test case:[BOOST] Verify module BOOST_DIR is defined and exists (gnu16/mvapich2)
Outcome:Passed
Duration:0.009 sec
Test case:[BOOST] Verify module BOOST_LIB is defined and exists (gnu16/mvapich2)
Outcome:Passed
Duration:0.008 sec
Test case:[BOOST] Verify dynamic library available in BOOST_LIB (gnu16/mvapich2)
Outcome:Passed
Duration:0.007 sec
Test case:[BOOST] Verify static library is not present in BOOST_LIB (gnu16/mvapich2)
Outcome:Passed
Duration:0.009 sec
Test case:[BOOST] Verify module BOOST_INC is defined and exists (gnu16/mvapich2)
Outcome:Passed
Duration:0.008 sec
Test case:[BOOST] Verify header file is present in BOOST_INC (gnu16/mvapich2)
Outcome:Passed
Duration:0.007 sec
Test case:[BOOST] Test interactive build/exec of f_test.cpp (gnu16/mvapich2)
Outcome:Passed
Duration:2.655 sec

Test Suite: test_module

Results

Duration2.973 sec
Tests8
Failures0

Tests

test_module

Test case:[BOOST] Verify BOOST module is loaded and matches rpm version (gnu16/openmpi5)
Outcome:Passed
Duration:0.234 sec
Test case:[BOOST] Verify module BOOST_DIR is defined and exists (gnu16/openmpi5)
Outcome:Passed
Duration:0.011 sec
Test case:[BOOST] Verify module BOOST_LIB is defined and exists (gnu16/openmpi5)
Outcome:Passed
Duration:0.009 sec
Test case:[BOOST] Verify dynamic library available in BOOST_LIB (gnu16/openmpi5)
Outcome:Passed
Duration:0.008 sec
Test case:[BOOST] Verify static library is not present in BOOST_LIB (gnu16/openmpi5)
Outcome:Passed
Duration:0.01 sec
Test case:[BOOST] Verify module BOOST_INC is defined and exists (gnu16/openmpi5)
Outcome:Passed
Duration:0.009 sec
Test case:[BOOST] Verify header file is present in BOOST_INC (gnu16/openmpi5)
Outcome:Passed
Duration:0.009 sec
Test case:[BOOST] Test interactive build/exec of f_test.cpp (gnu16/openmpi5)
Outcome:Passed
Duration:2.683 sec

Test Suite: test_module

Results

Duration0.277 sec
Tests7
Failures0

Tests

test_module

Test case:[BOOST] Verify BOOST module is loaded and matches rpm version (gnu16/mpich)
Outcome:Passed
Duration:0.227 sec
Test case:[BOOST] Verify module BOOST_DIR is defined and exists (gnu16/mpich)
Outcome:Passed
Duration:0.009 sec
Test case:[BOOST] Verify module BOOST_LIB is defined and exists (gnu16/mpich)
Outcome:Passed
Duration:0.009 sec
Test case:[BOOST] Verify dynamic library available in BOOST_LIB (gnu16/mpich)
Outcome:Passed
Duration:0.008 sec
Test case:[BOOST] Verify static library is not present in BOOST_LIB (gnu16/mpich)
Outcome:Passed
Duration:0.008 sec
Test case:[BOOST] Verify module BOOST_INC is defined and exists (gnu16/mpich)
Outcome:Passed
Duration:0.008 sec
Test case:[BOOST] Verify header file is present in BOOST_INC (gnu16/mpich)
Outcome:Passed
Duration:0.008 sec

Test Suite: test_module

Results

Duration0.278 sec
Tests7
Failures0

Tests

test_module

Test case:[BOOST] Verify BOOST module is loaded and matches rpm version (gnu16/mvapich2)
Outcome:Passed
Duration:0.225 sec
Test case:[BOOST] Verify module BOOST_DIR is defined and exists (gnu16/mvapich2)
Outcome:Passed
Duration:0.009 sec
Test case:[BOOST] Verify module BOOST_LIB is defined and exists (gnu16/mvapich2)
Outcome:Passed
Duration:0.01 sec
Test case:[BOOST] Verify dynamic library available in BOOST_LIB (gnu16/mvapich2)
Outcome:Passed
Duration:0.008 sec
Test case:[BOOST] Verify static library is not present in BOOST_LIB (gnu16/mvapich2)
Outcome:Passed
Duration:0.009 sec
Test case:[BOOST] Verify module BOOST_INC is defined and exists (gnu16/mvapich2)
Outcome:Passed
Duration:0.008 sec
Test case:[BOOST] Verify header file is present in BOOST_INC (gnu16/mvapich2)
Outcome:Passed
Duration:0.009 sec

Test Suite: rm_execution

Results

Duration0.0 sec
Tests1
Failures1

Tests

rm_execution

Test case:
Outcome:Failed
Duration:0.0 sec
Failed
(from function `ERROR' in file ./common/functions, line 11,
 from function `check_rms' in file ./common/functions, line 35,
 from function `setup_file' in test file rm_execution, line 14)
  `check_rms' failed with status 0
[OHPC-TEST:ERROR]: Unsupported or unknown resource manager

Test Suite: rm_execution

Results

Duration0.0 sec
Tests1
Failures1

Tests

rm_execution

Test case:
Outcome:Failed
Duration:0.0 sec
Failed
(from function `ERROR' in file ./common/functions, line 11,
 from function `check_rms' in file ./common/functions, line 35,
 from function `setup_file' in test file rm_execution, line 14)
  `check_rms' failed with status 0
[OHPC-TEST:ERROR]: Unsupported or unknown resource manager

Test Suite: test_module

Results

Duration0.247 sec
Tests7
Failures0

Tests

test_module

Test case:[FFTW] Verify FFTW module is loaded and matches rpm version (gnu16/mpich)
Outcome:Passed
Duration:0.19 sec
Test case:[FFTW] Verify module FFTW_DIR is defined and exists (gnu16/mpich)
Outcome:Passed
Duration:0.012 sec
Test case:[FFTW] Verify module FFTW_LIB is defined and exists (gnu16/mpich)
Outcome:Passed
Duration:0.01 sec
Test case:[FFTW] Verify dynamic library available in FFTW_LIB (gnu16/mpich)
Outcome:Passed
Duration:0.01 sec
Test case:[FFTW] Verify static library is not present in FFTW_LIB (gnu16/mpich)
Outcome:Passed
Duration:0.009 sec
Test case:[FFTW] Verify module FFTW_INC is defined and exists (gnu16/mpich)
Outcome:Passed
Duration:0.008 sec
Test case:[FFTW] Verify header file is present in FFTW_INC (gnu16/mpich)
Outcome:Passed
Duration:0.008 sec

Test Suite: test_module

Results

Duration0.248 sec
Tests7
Failures0

Tests

test_module

Test case:[FFTW] Verify FFTW module is loaded and matches rpm version (gnu16/mvapich2)
Outcome:Passed
Duration:0.192 sec
Test case:[FFTW] Verify module FFTW_DIR is defined and exists (gnu16/mvapich2)
Outcome:Passed
Duration:0.011 sec
Test case:[FFTW] Verify module FFTW_LIB is defined and exists (gnu16/mvapich2)
Outcome:Passed
Duration:0.009 sec
Test case:[FFTW] Verify dynamic library available in FFTW_LIB (gnu16/mvapich2)
Outcome:Passed
Duration:0.008 sec
Test case:[FFTW] Verify static library is not present in FFTW_LIB (gnu16/mvapich2)
Outcome:Passed
Duration:0.01 sec
Test case:[FFTW] Verify module FFTW_INC is defined and exists (gnu16/mvapich2)
Outcome:Passed
Duration:0.009 sec
Test case:[FFTW] Verify header file is present in FFTW_INC (gnu16/mvapich2)
Outcome:Passed
Duration:0.009 sec

Test Suite: rm_execution

Results

Duration0.0 sec
Tests1
Failures1

Tests

rm_execution

Test case:
Outcome:Failed
Duration:0.0 sec
Failed
(from function `ERROR' in file ../../../common/functions, line 11,
 from function `check_rms' in file ../../../common/functions, line 35,
 from function `setup_file' in test file rm_execution, line 17)
  `check_rms' failed with status 0
[OHPC-TEST:ERROR]: Unsupported or unknown resource manager

Test Suite: rm_execution

Results

Duration0.0 sec
Tests1
Failures1

Tests

rm_execution

Test case:
Outcome:Failed
Duration:0.0 sec
Failed
(from function `ERROR' in file ../../../common/functions, line 11,
 from function `check_rms' in file ../../../common/functions, line 35,
 from function `setup_file' in test file rm_execution, line 17)
  `check_rms' failed with status 0
[OHPC-TEST:ERROR]: Unsupported or unknown resource manager

Test Suite: test_module

Results

Duration0.237 sec
Tests7
Failures0

Tests

test_module

Test case:[libs/GSL] Verify GSL module is loaded and matches rpm version (gnu16)
Outcome:Passed
Duration:0.181 sec
Test case:[libs/GSL] Verify module GSL_DIR is defined and exists (gnu16)
Outcome:Passed
Duration:0.011 sec
Test case:[libs/GSL] Verify module GSL_LIB is defined and exists (gnu16)
Outcome:Passed
Duration:0.009 sec
Test case:[libs/GSL] Verify dynamic library available in GSL_LIB (gnu16)
Outcome:Passed
Duration:0.009 sec
Test case:[libs/GSL] Verify static library is not present in GSL_LIB (gnu16)
Outcome:Passed
Duration:0.009 sec
Test case:[libs/GSL] Verify module GSL_INC is defined and exists (gnu16)
Outcome:Passed
Duration:0.009 sec
Test case:[libs/GSL] Verify header file is present in GSL_INC (gnu16)
Outcome:Passed
Duration:0.009 sec

Test Suite: rm_execution

Results

Duration0.0 sec
Tests1
Failures1

Tests

rm_execution

Test case:
Outcome:Failed
Duration:0.0 sec
Failed
(from function `ERROR' in file ../../../common/functions, line 11,
 from function `check_rms' in file ../../../common/functions, line 35,
 from function `setup_file' in test file rm_execution, line 18)
  `check_rms' failed with status 0
[OHPC-TEST:ERROR]: Unsupported or unknown resource manager

Test Suite: test_module

Results

Duration0.346 sec
Tests7
Failures0

Tests

test_module

Test case:[libs/HYPRE] Verify HYPRE module is loaded and matches rpm version (gnu16/mvapich2)
Outcome:Passed
Duration:0.229 sec
Test case:[libs/HYPRE] Verify HYPRE_DIR is defined and directory exists (gnu16/mvapich2)
Outcome:Passed
Duration:0.018 sec
Test case:[libs/HYPRE] Verify module HYPRE_LIB is defined and exists (gnu16/mvapich2)
Outcome:Passed
Duration:0.02 sec
Test case:[libs/HYPRE] Verify dynamic library available in HYPRE_LIB (gnu16/mvapich2)
Outcome:Passed
Duration:0.019 sec
Test case:[libs/HYPRE] Verify static library is not present in HYPRE_LIB (gnu16/mvapich2)
Outcome:Passed
Duration:0.02 sec
Test case:[libs/HYPRE] Verify module HYPRE_INC is defined and exists (gnu16/mvapich2)
Outcome:Passed
Duration:0.021 sec
Test case:[libs/HYPRE] Verify header file is present in HYPRE_INC (gnu16/mvapich2)
Outcome:Passed
Duration:0.019 sec

Test Suite: rm_execution

Results

Duration0.0 sec
Tests1
Failures1

Tests

rm_execution

Test case:
Outcome:Failed
Duration:0.0 sec
Failed
(from function `ERROR' in file ../../../common/functions, line 11,
 from function `check_rms' in file ../../../common/functions, line 35,
 from function `setup_file' in test file rm_execution, line 18)
  `check_rms' failed with status 0
[OHPC-TEST:ERROR]: Unsupported or unknown resource manager

Test Suite: test_module

Results

Duration0.342 sec
Tests7
Failures0

Tests

test_module

Test case:[libs/HYPRE] Verify HYPRE module is loaded and matches rpm version (gnu16/mpich)
Outcome:Passed
Duration:0.219 sec
Test case:[libs/HYPRE] Verify HYPRE_DIR is defined and directory exists (gnu16/mpich)
Outcome:Passed
Duration:0.021 sec
Test case:[libs/HYPRE] Verify module HYPRE_LIB is defined and exists (gnu16/mpich)
Outcome:Passed
Duration:0.02 sec
Test case:[libs/HYPRE] Verify dynamic library available in HYPRE_LIB (gnu16/mpich)
Outcome:Passed
Duration:0.021 sec
Test case:[libs/HYPRE] Verify static library is not present in HYPRE_LIB (gnu16/mpich)
Outcome:Passed
Duration:0.02 sec
Test case:[libs/HYPRE] Verify module HYPRE_INC is defined and exists (gnu16/mpich)
Outcome:Passed
Duration:0.021 sec
Test case:[libs/HYPRE] Verify header file is present in HYPRE_INC (gnu16/mpich)
Outcome:Passed
Duration:0.02 sec

Test Suite: test_module

Results

Duration0.279 sec
Tests9
Failures0

Tests

test_module

Test case:[libs/Metis] Verify METIS module is loaded and matches rpm version (gnu16)
Outcome:Passed
Duration:0.19 sec
Test case:[libs/Metis] Verify module METIS_DIR is defined and exists (gnu16)
Outcome:Passed
Duration:0.01 sec
Test case:[libs/Metis] Verify module METIS_BIN is defined and exists (gnu16)
Outcome:Passed
Duration:0.01 sec
Test case:[libs/Metis] Verify availability of m2gmetis binary (gnu16)
Outcome:Passed
Duration:0.028 sec
Test case:[libs/Metis] Verify module METIS_LIB is defined and exists (gnu16)
Outcome:Passed
Duration:0.009 sec
Test case:[libs/Metis] Verify dynamic library available in METIS_LIB (gnu16)
Outcome:Passed
Duration:0.008 sec
Test case:[libs/Metis] Verify static library is not present in METIS_LIB (gnu16)
Outcome:Passed
Duration:0.008 sec
Test case:[libs/Metis] Verify module METIS_INC is defined and exists (gnu16)
Outcome:Passed
Duration:0.007 sec
Test case:[libs/Metis] Verify header file is present in METIS_INC (gnu16)
Outcome:Passed
Duration:0.009 sec

Test Suite: test_module

Results

Duration0.22 sec
Tests2
Failures0

Tests

test_module

Test case:[libs/MUMPS] Verify MUMPS module is loaded and matches rpm version (gnu16-mpich)
Outcome:Passed
Duration:0.21 sec
Test case:[libs/MUMPS] Verify MUMPS_DIR is defined and directory exists (gnu16-mpich)
Outcome:Passed
Duration:0.01 sec

Test Suite: test_module

Results

Duration0.214 sec
Tests2
Failures0

Tests

test_module

Test case:[libs/MUMPS] Verify MUMPS module is loaded and matches rpm version (gnu16-mvapich2)
Outcome:Passed
Duration:0.204 sec
Test case:[libs/MUMPS] Verify MUMPS_DIR is defined and directory exists (gnu16-mvapich2)
Outcome:Passed
Duration:0.01 sec

Test Suite: test_C_module

Results

Duration0.408 sec
Tests9
Failures0

Tests

test_C_module

Test case:[libs/NetCDF] Verify NETCDF module is loaded and matches rpm version (gnu16/mpich)
Outcome:Passed
Duration:0.217 sec
Test case:[libs/NetCDF] Verify module NETCDF_DIR is defined and exists (gnu16/mpich)
Outcome:Passed
Duration:0.023 sec
Test case:[libs/NetCDF] Verify module NETCDF_BIN is defined and exists (gnu16/mpich)
Outcome:Passed
Duration:0.021 sec
Test case:[libs/NetCDF] Verify availability of nc-config binary (gnu16/mpich)
Outcome:Passed
Duration:0.047 sec
Test case:[libs/NetCDF] Verify module NETCDF_LIB is defined and exists (gnu16/mpich)
Outcome:Passed
Duration:0.021 sec
Test case:[libs/NetCDF] Verify dynamic library available in NETCDF_LIB (gnu16/mpich)
Outcome:Passed
Duration:0.019 sec
Test case:[libs/NetCDF] Verify static library is not present in NETCDF_LIB (gnu16/mpich)
Outcome:Passed
Duration:0.02 sec
Test case:[libs/NetCDF] Verify module NETCDF_INC is defined and exists (gnu16/mpich)
Outcome:Passed
Duration:0.021 sec
Test case:[libs/NetCDF] Verify header file is present in NETCDF_INC (gnu16/mpich)
Outcome:Passed
Duration:0.019 sec

Test Suite: test_CXX_module

Results

Duration0.425 sec
Tests9
Failures0

Tests

test_CXX_module

Test case:[libs/NetCDF-CXX] Verify NETCDF_CXX module is loaded and matches rpm version (gnu16/mpich)
Outcome:Passed
Duration:0.235 sec
Test case:[libs/NetCDF-CXX] Verify module NETCDF_CXX_DIR is defined and exists (gnu16/mpich)
Outcome:Passed
Duration:0.021 sec
Test case:[libs/NetCDF-CXX] Verify module NETCDF_CXX_BIN is defined and exists (gnu16/mpich)
Outcome:Passed
Duration:0.022 sec
Test case:[libs/NetCDF-CXX] Verify availability of ncxx4-config binary (gnu16/mpich)
Outcome:Passed
Duration:0.046 sec
Test case:[libs/NetCDF-CXX] Verify module NETCDF_CXX_LIB is defined and exists (gnu16/mpich)
Outcome:Passed
Duration:0.02 sec
Test case:[libs/NetCDF-CXX] Verify dynamic library available in NETCDF_CXX_LIB (gnu16/mpich)
Outcome:Passed
Duration:0.02 sec
Test case:[libs/NetCDF-CXX] Verify static library is not present in NETCDF_CXX_LIB (gnu16/mpich)
Outcome:Passed
Duration:0.02 sec
Test case:[libs/NetCDF-CXX] Verify module NETCDF_CXX_INC is defined and exists (gnu16/mpich)
Outcome:Passed
Duration:0.021 sec
Test case:[libs/NetCDF-CXX] Verify header file is present in NETCDF_CXX_INC (gnu16/mpich)
Outcome:Passed
Duration:0.02 sec

Test Suite: test_Fortran_module

Results

Duration0.413 sec
Tests9
Failures0

Tests

test_Fortran_module

Test case:[libs/NetCDF-Fortran] Verify NETCDF_FORTRAN module is loaded and matches rpm version (gnu16/mpich)
Outcome:Passed
Duration:0.222 sec
Test case:[libs/NetCDF-Fortran] Verify module NETCDF_FORTRAN_DIR is defined and exists (gnu16/mpich)
Outcome:Passed
Duration:0.02 sec
Test case:[libs/NetCDF-Fortran] Verify module NETCDF_FORTRAN_BIN is defined and exists (gnu16/mpich)
Outcome:Passed
Duration:0.021 sec
Test case:[libs/NetCDF-Fortran] Verify availability of nf-config binary (gnu16/mpich)
Outcome:Passed
Duration:0.047 sec
Test case:[libs/NetCDF-Fortran] Verify module NETCDF_FORTRAN_LIB is defined and exists (gnu16/mpich)
Outcome:Passed
Duration:0.021 sec
Test case:[libs/NetCDF-Fortran] Verify dynamic library available in NETCDF_FORTRAN_LIB (gnu16/mpich)
Outcome:Passed
Duration:0.02 sec
Test case:[libs/NetCDF-Fortran] Verify static library is not present in NETCDF_FORTRAN_LIB (gnu16/mpich)
Outcome:Passed
Duration:0.021 sec
Test case:[libs/NetCDF-Fortran] Verify module NETCDF_FORTRAN_INC is defined and exists (gnu16/mpich)
Outcome:Passed
Duration:0.021 sec
Test case:[libs/NetCDF-Fortran] Verify header file is present in NETCDF_FORTRAN_INC (gnu16/mpich)
Outcome:Passed
Duration:0.02 sec

Test Suite: test_netcdf

Results

Duration0.0 sec
Tests1
Failures1

Tests

test_netcdf

Test case:
Outcome:Failed
Duration:0.0 sec
Failed
(from function `ERROR' in file ./common/functions, line 11,
 from function `check_rms' in file ./common/functions, line 35,
 from function `setup_file' in test file test_netcdf, line 11)
  `check_rms' failed with status 0
[OHPC-TEST:ERROR]: Unsupported or unknown resource manager

Test Suite: test_C_module

Results

Duration0.399 sec
Tests9
Failures0

Tests

test_C_module

Test case:[libs/NetCDF] Verify NETCDF module is loaded and matches rpm version (gnu16/mvapich2)
Outcome:Passed
Duration:0.212 sec
Test case:[libs/NetCDF] Verify module NETCDF_DIR is defined and exists (gnu16/mvapich2)
Outcome:Passed
Duration:0.021 sec
Test case:[libs/NetCDF] Verify module NETCDF_BIN is defined and exists (gnu16/mvapich2)
Outcome:Passed
Duration:0.018 sec
Test case:[libs/NetCDF] Verify availability of nc-config binary (gnu16/mvapich2)
Outcome:Passed
Duration:0.048 sec
Test case:[libs/NetCDF] Verify module NETCDF_LIB is defined and exists (gnu16/mvapich2)
Outcome:Passed
Duration:0.02 sec
Test case:[libs/NetCDF] Verify dynamic library available in NETCDF_LIB (gnu16/mvapich2)
Outcome:Passed
Duration:0.02 sec
Test case:[libs/NetCDF] Verify static library is not present in NETCDF_LIB (gnu16/mvapich2)
Outcome:Passed
Duration:0.02 sec
Test case:[libs/NetCDF] Verify module NETCDF_INC is defined and exists (gnu16/mvapich2)
Outcome:Passed
Duration:0.02 sec
Test case:[libs/NetCDF] Verify header file is present in NETCDF_INC (gnu16/mvapich2)
Outcome:Passed
Duration:0.02 sec

Test Suite: test_CXX_module

Results

Duration0.42 sec
Tests9
Failures0

Tests

test_CXX_module

Test case:[libs/NetCDF-CXX] Verify NETCDF_CXX module is loaded and matches rpm version (gnu16/mvapich2)
Outcome:Passed
Duration:0.229 sec
Test case:[libs/NetCDF-CXX] Verify module NETCDF_CXX_DIR is defined and exists (gnu16/mvapich2)
Outcome:Passed
Duration:0.019 sec
Test case:[libs/NetCDF-CXX] Verify module NETCDF_CXX_BIN is defined and exists (gnu16/mvapich2)
Outcome:Passed
Duration:0.021 sec
Test case:[libs/NetCDF-CXX] Verify availability of ncxx4-config binary (gnu16/mvapich2)
Outcome:Passed
Duration:0.049 sec
Test case:[libs/NetCDF-CXX] Verify module NETCDF_CXX_LIB is defined and exists (gnu16/mvapich2)
Outcome:Passed
Duration:0.021 sec
Test case:[libs/NetCDF-CXX] Verify dynamic library available in NETCDF_CXX_LIB (gnu16/mvapich2)
Outcome:Passed
Duration:0.02 sec
Test case:[libs/NetCDF-CXX] Verify static library is not present in NETCDF_CXX_LIB (gnu16/mvapich2)
Outcome:Passed
Duration:0.02 sec
Test case:[libs/NetCDF-CXX] Verify module NETCDF_CXX_INC is defined and exists (gnu16/mvapich2)
Outcome:Passed
Duration:0.02 sec
Test case:[libs/NetCDF-CXX] Verify header file is present in NETCDF_CXX_INC (gnu16/mvapich2)
Outcome:Passed
Duration:0.021 sec

Test Suite: test_Fortran_module

Results

Duration0.417 sec
Tests9
Failures0

Tests

test_Fortran_module

Test case:[libs/NetCDF-Fortran] Verify NETCDF_FORTRAN module is loaded and matches rpm version (gnu16/mvapich2)
Outcome:Passed
Duration:0.229 sec
Test case:[libs/NetCDF-Fortran] Verify module NETCDF_FORTRAN_DIR is defined and exists (gnu16/mvapich2)
Outcome:Passed
Duration:0.021 sec
Test case:[libs/NetCDF-Fortran] Verify module NETCDF_FORTRAN_BIN is defined and exists (gnu16/mvapich2)
Outcome:Passed
Duration:0.018 sec
Test case:[libs/NetCDF-Fortran] Verify availability of nf-config binary (gnu16/mvapich2)
Outcome:Passed
Duration:0.046 sec
Test case:[libs/NetCDF-Fortran] Verify module NETCDF_FORTRAN_LIB is defined and exists (gnu16/mvapich2)
Outcome:Passed
Duration:0.02 sec
Test case:[libs/NetCDF-Fortran] Verify dynamic library available in NETCDF_FORTRAN_LIB (gnu16/mvapich2)
Outcome:Passed
Duration:0.02 sec
Test case:[libs/NetCDF-Fortran] Verify static library is not present in NETCDF_FORTRAN_LIB (gnu16/mvapich2)
Outcome:Passed
Duration:0.021 sec
Test case:[libs/NetCDF-Fortran] Verify module NETCDF_FORTRAN_INC is defined and exists (gnu16/mvapich2)
Outcome:Passed
Duration:0.021 sec
Test case:[libs/NetCDF-Fortran] Verify header file is present in NETCDF_FORTRAN_INC (gnu16/mvapich2)
Outcome:Passed
Duration:0.021 sec

Test Suite: test_netcdf

Results

Duration0.0 sec
Tests1
Failures1

Tests

test_netcdf

Test case:
Outcome:Failed
Duration:0.0 sec
Failed
(from function `ERROR' in file ./common/functions, line 11,
 from function `check_rms' in file ./common/functions, line 35,
 from function `setup_file' in test file test_netcdf, line 11)
  `check_rms' failed with status 0
[OHPC-TEST:ERROR]: Unsupported or unknown resource manager

Test Suite: test_pnetcdf

Results

Duration0.0 sec
Tests1
Failures1

Tests

test_pnetcdf

Test case:
Outcome:Failed
Duration:0.0 sec
Failed
(from function `ERROR' in file ./common/functions, line 11,
 from function `check_rms' in file ./common/functions, line 35,
 from function `setup_file' in test file test_pnetcdf, line 12)
  `check_rms' failed with status 0
[OHPC-TEST:ERROR]: Unsupported or unknown resource manager

Test Suite: test_pnetcdf

Results

Duration0.0 sec
Tests1
Failures1

Tests

test_pnetcdf

Test case:
Outcome:Failed
Duration:0.0 sec
Failed
(from function `ERROR' in file ./common/functions, line 11,
 from function `check_rms' in file ./common/functions, line 35,
 from function `setup_file' in test file test_pnetcdf, line 12)
  `check_rms' failed with status 0
[OHPC-TEST:ERROR]: Unsupported or unknown resource manager

Test Suite: rm_execution

Results

Duration0.0 sec
Tests1
Failures1

Tests

rm_execution

Test case:
Outcome:Failed
Duration:0.0 sec
Failed
(from function `ERROR' in file ../../../common/functions, line 11,
 from function `check_rms' in file ../../../common/functions, line 35,
 from function `setup_file' in test file rm_execution, line 12)
  `check_rms' failed with status 0
[OHPC-TEST:ERROR]: Unsupported or unknown resource manager

Test Suite: test_lapack

Results

Duration0.339 sec
Tests1
Failures0

Tests

test_lapack

Test case:[libs/OpenBLAS/eigen] run lapack eigen-value solver (gnu16)
Outcome:Passed
Duration:0.339 sec

Test Suite: test_module

Results

Duration0.28 sec
Tests5
Failures0

Tests

test_module

Test case:[libs/OpenBLAS] Verify OPENBLAS module is loaded and matches rpm version (gnu16)
Outcome:Passed
Duration:0.202 sec
Test case:[libs/OpenBLAS] Verify OPENBLAS_DIR is defined and directory exists (gnu16)
Outcome:Passed
Duration:0.021 sec
Test case:[libs/OpenBLAS] Verify module OPENBLAS_LIB is defined and exists (gnu16)
Outcome:Passed
Duration:0.019 sec
Test case:[libs/OpenBLAS] Verify dynamic library available in OPENBLAS_LIB (gnu16)
Outcome:Passed
Duration:0.019 sec
Test case:[libs/OpenBLAS] Verify static library is not present in OPENBLAS_LIB (gnu16)
Outcome:Passed
Duration:0.019 sec

Test Suite: rm_execution

Results

Duration0.0 sec
Tests1
Failures1

Tests

rm_execution

Test case:
Outcome:Failed
Duration:0.0 sec
Failed
(from function `ERROR' in file ../../../common/functions, line 11,
 from function `check_rms' in file ../../../common/functions, line 35,
 from function `setup_file' in test file rm_execution, line 17)
  `check_rms' failed with status 0
[OHPC-TEST:ERROR]: Unsupported or unknown resource manager

Test Suite: test_module

Results

Duration0.0 sec
Tests1
Failures1

Tests

test_module

Test case:
Outcome:Failed
Duration:0.0 sec
Failed
(from function `ERROR' in file ../../../common/functions, line 11,
 from function `check_rms' in file ../../../common/functions, line 35,
 from function `setup_file' in test file test_module, line 18)
  `check_rms' failed with status 0
[OHPC-TEST:ERROR]: Unsupported or unknown resource manager

Test Suite: rm_execution

Results

Duration0.0 sec
Tests1
Failures1

Tests

rm_execution

Test case:
Outcome:Failed
Duration:0.0 sec
Failed
(from function `ERROR' in file ../../../common/functions, line 11,
 from function `check_rms' in file ../../../common/functions, line 35,
 from function `setup_file' in test file rm_execution, line 17)
  `check_rms' failed with status 0
[OHPC-TEST:ERROR]: Unsupported or unknown resource manager

Test Suite: test_module

Results

Duration0.0 sec
Tests1
Failures1

Tests

test_module

Test case:
Outcome:Failed
Duration:0.0 sec
Failed
(from function `ERROR' in file ../../../common/functions, line 11,
 from function `check_rms' in file ../../../common/functions, line 35,
 from function `setup_file' in test file test_module, line 18)
  `check_rms' failed with status 0
[OHPC-TEST:ERROR]: Unsupported or unknown resource manager

Test Suite: rm_execution

Results

Duration0.0 sec
Tests1
Failures1

Tests

rm_execution

Test case:
Outcome:Failed
Duration:0.0 sec
Failed
(from function `teardown_file' in test file rm_execution, line 32)
  `teardown_file() {' failed with status 0
[OHPC-TEST:ERROR]: Unsupported or unknown resource manager

Test Suite: test_module

Results

Duration0.334 sec
Tests7
Failures0

Tests

test_module

Test case:[libs/PHDF5] Verify HDF5 module is loaded and matches rpm version (gnu16-mpich)
Outcome:Passed
Duration:0.215 sec
Test case:[libs/PHDF5] Verify HDF5_DIR is defined and directory exists (gnu16-mpich)
Outcome:Passed
Duration:0.019 sec
Test case:[libs/PHDF5] Verify module HDF5_LIB is defined and exists (gnu16-mpich)
Outcome:Passed
Duration:0.021 sec
Test case:[libs/PHDF5] Verify dynamic library available in HDF5_LIB (gnu16-mpich)
Outcome:Passed
Duration:0.018 sec
Test case:[libs/PHDF5] Verify static library is not present in HDF5_LIB (gnu16-mpich)
Outcome:Passed
Duration:0.021 sec
Test case:[libs/PHDF5] Verify module HDF5_INC is defined and exists (gnu16-mpich)
Outcome:Passed
Duration:0.02 sec
Test case:[libs/PHDF5] Verify header file is present in HDF5_INC (gnu16-mpich)
Outcome:Passed
Duration:0.02 sec

Test Suite: rm_execution

Results

Duration0.0 sec
Tests1
Failures1

Tests

rm_execution

Test case:
Outcome:Failed
Duration:0.0 sec
Failed
(from function `teardown_file' in test file rm_execution, line 32)
  `teardown_file() {' failed with status 0
[OHPC-TEST:ERROR]: Unsupported or unknown resource manager

Test Suite: test_module

Results

Duration0.331 sec
Tests7
Failures0

Tests

test_module

Test case:[libs/PHDF5] Verify HDF5 module is loaded and matches rpm version (gnu16-mvapich2)
Outcome:Passed
Duration:0.21 sec
Test case:[libs/PHDF5] Verify HDF5_DIR is defined and directory exists (gnu16-mvapich2)
Outcome:Passed
Duration:0.021 sec
Test case:[libs/PHDF5] Verify module HDF5_LIB is defined and exists (gnu16-mvapich2)
Outcome:Passed
Duration:0.021 sec
Test case:[libs/PHDF5] Verify dynamic library available in HDF5_LIB (gnu16-mvapich2)
Outcome:Passed
Duration:0.021 sec
Test case:[libs/PHDF5] Verify static library is not present in HDF5_LIB (gnu16-mvapich2)
Outcome:Passed
Duration:0.019 sec
Test case:[libs/PHDF5] Verify module HDF5_INC is defined and exists (gnu16-mvapich2)
Outcome:Passed
Duration:0.02 sec
Test case:[libs/PHDF5] Verify header file is present in HDF5_INC (gnu16-mvapich2)
Outcome:Passed
Duration:0.019 sec

Test Suite: rm_execution

Results

Duration0.0 sec
Tests1
Failures1

Tests

rm_execution

Test case:
Outcome:Failed
Duration:0.0 sec
Failed
(from function `ERROR' in file ../../../common/functions, line 11,
 from function `check_rms' in file ../../../common/functions, line 35,
 from function `setup_file' in test file rm_execution, line 12)
  `check_rms' failed with status 0
[OHPC-TEST:ERROR]: Unsupported or unknown resource manager

Test Suite: test_module

Results

Duration0.34 sec
Tests7
Failures0

Tests

test_module

Test case:[libs/PLASMA] Verify PLASMA module is loaded and matches rpm version (gnu16)
Outcome:Passed
Duration:0.222 sec
Test case:[libs/PLASMA] Verify PLASMA_DIR is defined and directory exists (gnu16)
Outcome:Passed
Duration:0.021 sec
Test case:[libs/PLASMA] Verify module PLASMA_LIB is defined and exists (gnu16)
Outcome:Passed
Duration:0.02 sec
Test case:[libs/PLASMA] Verify dynamic library available in PLASMA_LIB (gnu16)
Outcome:Passed
Duration:0.019 sec
Test case:[libs/PLASMA] Verify static library is not present in PLASMA_LIB (gnu16)
Outcome:Passed
Duration:0.02 sec
Test case:[libs/PLASMA] Verify module PLASMA_INC is defined and exists (gnu16)
Outcome:Passed
Duration:0.019 sec
Test case:[libs/PLASMA] Verify header file is present in PLASMA_INC (gnu16)
Outcome:Passed
Duration:0.019 sec

Test Suite: test_module

Results

Duration0.238 sec
Tests5
Failures0

Tests

test_module

Test case:[PNETCDF] Verify PNETCDF module is loaded and matches rpm version (gnu16)
Outcome:Passed
Duration:0.2 sec
Test case:[PNETCDF] Verify module PNETCDF_DIR is defined and exists (gnu16)
Outcome:Passed
Duration:0.011 sec
Test case:[PNETCDF] Verify module PNETCDF_LIB is defined and exists (gnu16)
Outcome:Passed
Duration:0.008 sec
Test case:[PNETCDF] Verify module PNETCDF_INC is defined and exists (gnu16)
Outcome:Passed
Duration:0.01 sec
Test case:[PNETCDF] Verify header file is present in PNETCDF_INC (gnu16)
Outcome:Passed
Duration:0.009 sec

Test Suite: rm_execution

Results

Duration0.0 sec
Tests1
Failures1

Tests

rm_execution

Test case:
Outcome:Failed
Duration:0.0 sec
Failed
(from function `ERROR' in file ../../../common/functions, line 11,
 from function `check_rms' in file ../../../common/functions, line 35,
 from function `setup_file' in test file rm_execution, line 12)
  `check_rms' failed with status 0
[OHPC-TEST:ERROR]: Unsupported or unknown resource manager

Test Suite: test_module

Results

Duration0.383 sec
Tests9
Failures0

Tests

test_module

Test case:[libs/PTScotch] Verify PTSCOTCH module is loaded and matches rpm version (gnu16-mpich)
Outcome:Passed
Duration:0.217 sec
Test case:[libs/PTScotch] Verify PTSCOTCH_DIR is defined and directory exists (gnu16-mpich)
Outcome:Passed
Duration:0.021 sec
Test case:[libs/PTScotch] Verify module PTSCOTCH_LIB is defined and exists (gnu16-mpich)
Outcome:Passed
Duration:0.02 sec
Test case:[libs/PTScotch] Verify dynamic library available in PTSCOTCH_LIB (gnu16-mpich)
Outcome:Passed
Duration:0.02 sec
Test case:[libs/PTScotch] Verify static library is not present in PTSCOTCH_LIB (gnu16-mpich)
Outcome:Passed
Duration:0.019 sec
Test case:[libs/PTScotch] Verify module PTSCOTCH_INC is defined and exists (gnu16-mpich)
Outcome:Passed
Duration:0.018 sec
Test case:[libs/PTScotch] Verify header file is present in PTSCOTCH_INC (gnu16-mpich)
Outcome:Passed
Duration:0.02 sec
Test case:[libs/PTScotch] Verify module PTSCOTCH_BIN is defined and exists (gnu16-mpich)
Outcome:Passed
Duration:0.019 sec
Test case:[libs/PTScotch] Verify availability of dgscat binary (gnu16-mpich)
Outcome:Passed
Duration:0.029 sec

Test Suite: rm_execution

Results

Duration0.0 sec
Tests1
Failures1

Tests

rm_execution

Test case:
Outcome:Failed
Duration:0.0 sec
Failed
(from function `ERROR' in file ../../../common/functions, line 11,
 from function `check_rms' in file ../../../common/functions, line 35,
 from function `setup_file' in test file rm_execution, line 12)
  `check_rms' failed with status 0
[OHPC-TEST:ERROR]: Unsupported or unknown resource manager

Test Suite: test_module

Results

Duration0.389 sec
Tests9
Failures0

Tests

test_module

Test case:[libs/PTScotch] Verify PTSCOTCH module is loaded and matches rpm version (gnu16-mvapich2)
Outcome:Passed
Duration:0.215 sec
Test case:[libs/PTScotch] Verify PTSCOTCH_DIR is defined and directory exists (gnu16-mvapich2)
Outcome:Passed
Duration:0.02 sec
Test case:[libs/PTScotch] Verify module PTSCOTCH_LIB is defined and exists (gnu16-mvapich2)
Outcome:Passed
Duration:0.022 sec
Test case:[libs/PTScotch] Verify dynamic library available in PTSCOTCH_LIB (gnu16-mvapich2)
Outcome:Passed
Duration:0.02 sec
Test case:[libs/PTScotch] Verify static library is not present in PTSCOTCH_LIB (gnu16-mvapich2)
Outcome:Passed
Duration:0.021 sec
Test case:[libs/PTScotch] Verify module PTSCOTCH_INC is defined and exists (gnu16-mvapich2)
Outcome:Passed
Duration:0.02 sec
Test case:[libs/PTScotch] Verify header file is present in PTSCOTCH_INC (gnu16-mvapich2)
Outcome:Passed
Duration:0.02 sec
Test case:[libs/PTScotch] Verify module PTSCOTCH_BIN is defined and exists (gnu16-mvapich2)
Outcome:Passed
Duration:0.019 sec
Test case:[libs/PTScotch] Verify availability of dgscat binary (gnu16-mvapich2)
Outcome:Passed
Duration:0.032 sec

Test Suite: rm_execution

Results

Duration0.0 sec
Tests1
Failures1

Tests

rm_execution

Test case:
Outcome:Failed
Duration:0.0 sec
Failed
(from function `ERROR' in file ./common/functions, line 11,
 from function `check_rms' in file ./common/functions, line 35,
 from function `setup_file' in test file rm_execution, line 12)
  `check_rms' failed with status 0
[OHPC-TEST:ERROR]: Unsupported or unknown resource manager

Test Suite: test_module

Results

Duration0.0 sec
Tests1
Failures1

Tests

test_module

Test case:
Outcome:Failed
Duration:0.0 sec
Failed
(from function `ERROR' in file ./common/functions, line 11,
 from function `check_rms' in file ./common/functions, line 35,
 from function `setup_file' in test file test_module, line 18)
  `check_rms' failed with status 0
[OHPC-TEST:ERROR]: Unsupported or unknown resource manager

Test Suite: rm_execution

Results

Duration0.0 sec
Tests1
Failures1

Tests

rm_execution

Test case:
Outcome:Failed
Duration:0.0 sec
Failed
(from function `ERROR' in file ./common/functions, line 11,
 from function `check_rms' in file ./common/functions, line 35,
 from function `setup_file' in test file rm_execution, line 12)
  `check_rms' failed with status 0
[OHPC-TEST:ERROR]: Unsupported or unknown resource manager

Test Suite: test_module

Results

Duration0.0 sec
Tests1
Failures1

Tests

test_module

Test case:
Outcome:Failed
Duration:0.0 sec
Failed
(from function `ERROR' in file ./common/functions, line 11,
 from function `check_rms' in file ./common/functions, line 35,
 from function `setup_file' in test file test_module, line 18)
  `check_rms' failed with status 0
[OHPC-TEST:ERROR]: Unsupported or unknown resource manager

Test Suite: rm_execution

Results

Duration0.0 sec
Tests1
Failures1

Tests

rm_execution

Test case:
Outcome:Failed
Duration:0.0 sec
Failed
(from function `ERROR' in file ../../../common/functions, line 11,
 from function `check_rms' in file ../../../common/functions, line 35,
 from function `setup_file' in test file rm_execution, line 12)
  `check_rms' failed with status 0
[OHPC-TEST:ERROR]: Unsupported or unknown resource manager

Test Suite: test_module

Results

Duration0.366 sec
Tests9
Failures0

Tests

test_module

Test case:[libs/Scotch] Verify SCOTCH module is loaded and matches rpm version (gnu16)
Outcome:Passed
Duration:0.202 sec
Test case:[libs/Scotch] Verify SCOTCH_DIR is defined and directory exists (gnu16)
Outcome:Passed
Duration:0.02 sec
Test case:[libs/Scotch] Verify module SCOTCH_LIB is defined and exists (gnu16)
Outcome:Passed
Duration:0.02 sec
Test case:[libs/Scotch] Verify dynamic library available in SCOTCH_LIB (gnu16)
Outcome:Passed
Duration:0.02 sec
Test case:[libs/Scotch] Verify static library is not present in SCOTCH_LIB (gnu16)
Outcome:Passed
Duration:0.019 sec
Test case:[libs/Scotch] Verify module SCOTCH_INC is defined and exists (gnu16)
Outcome:Passed
Duration:0.018 sec
Test case:[libs/Scotch] Verify header file is present in SCOTCH_INC (gnu16)
Outcome:Passed
Duration:0.019 sec
Test case:[libs/Scotch] Verify module SCOTCH_BIN is defined and exists (gnu16)
Outcome:Passed
Duration:0.018 sec
Test case:[libs/Scotch] Verify availability of gout binary (gnu16)
Outcome:Passed
Duration:0.03 sec

Test Suite: rm_execution

Results

Duration0.0 sec
Tests1
Failures1

Tests

rm_execution

Test case:
Outcome:Failed
Duration:0.0 sec
Failed
(from function `ERROR' in file ../../../common/functions, line 11,
 from function `check_rms' in file ../../../common/functions, line 35,
 from function `setup_file' in test file rm_execution, line 12)
  `check_rms' failed with status 0
[OHPC-TEST:ERROR]: Unsupported or unknown resource manager

Test Suite: test_module

Results

Duration0.339 sec
Tests7
Failures0

Tests

test_module

Test case:[libs/SuperLU] Verify SUPERLU module is loaded and matches rpm version (gnu16)
Outcome:Passed
Duration:0.218 sec
Test case:[libs/SuperLU] Verify SUPERLU_DIR is defined and directory exists (gnu16)
Outcome:Passed
Duration:0.021 sec
Test case:[libs/SuperLU] Verify module SUPERLU_LIB is defined and exists (gnu16)
Outcome:Passed
Duration:0.02 sec
Test case:[libs/SuperLU] Verify dynamic library available in SUPERLU_LIB (gnu16)
Outcome:Passed
Duration:0.02 sec
Test case:[libs/SuperLU] Verify static library is not present in SUPERLU_LIB (gnu16)
Outcome:Passed
Duration:0.021 sec
Test case:[libs/SuperLU] Verify module SUPERLU_INC is defined and exists (gnu16)
Outcome:Passed
Duration:0.021 sec
Test case:[libs/SuperLU] Verify header file is present in SUPERLU_INC (gnu16)
Outcome:Passed
Duration:0.018 sec

Test Suite: rm_execution

Results

Duration0.0 sec
Tests1
Failures1

Tests

rm_execution

Test case:
Outcome:Failed
Duration:0.0 sec
Failed
(from function `ERROR' in file ../../../common/functions, line 11,
 from function `check_rms' in file ../../../common/functions, line 35,
 from function `setup_file' in test file rm_execution, line 19)
  `check_rms' failed with status 0
[OHPC-TEST:ERROR]: Unsupported or unknown resource manager

Test Suite: test_module

Results

Duration0.363 sec
Tests7
Failures0

Tests

test_module

Test case:[libs/SuperLU_DIST] Verify SUPERLU_DIST module is loaded and matches rpm version (gnu16/mvapich2)
Outcome:Passed
Duration:0.241 sec
Test case:[libs/SuperLU_DIST] Verify SUPERLU_DIST_DIR is defined and directory exists (gnu16/mvapich2)
Outcome:Passed
Duration:0.021 sec
Test case:[libs/SuperLU_DIST] Verify module SUPERLU_DIST_LIB is defined and exists (gnu16/mvapich2)
Outcome:Passed
Duration:0.018 sec
Test case:[libs/SuperLU_DIST] Verify dynamic library available in SUPERLU_DIST_LIB (gnu16/mvapich2)
Outcome:Passed
Duration:0.021 sec
Test case:[libs/SuperLU_DIST] Verify static library is not present in SUPERLU_DIST_LIB (gnu16/mvapich2)
Outcome:Passed
Duration:0.021 sec
Test case:[libs/SuperLU_DIST] Verify module SUPERLU_DIST_INC is defined and exists (gnu16/mvapich2)
Outcome:Passed
Duration:0.021 sec
Test case:[libs/SuperLU_DIST] Verify header file is present in SUPERLU_DIST_INC (gnu16/mvapich2)
Outcome:Passed
Duration:0.02 sec

Test Suite: rm_execution

Results

Duration0.0 sec
Tests1
Failures1

Tests

rm_execution

Test case:
Outcome:Failed
Duration:0.0 sec
Failed
(from function `ERROR' in file ../../../common/functions, line 11,
 from function `check_rms' in file ../../../common/functions, line 35,
 from function `setup_file' in test file rm_execution, line 19)
  `check_rms' failed with status 0
[OHPC-TEST:ERROR]: Unsupported or unknown resource manager

Test Suite: test_module

Results

Duration0.358 sec
Tests7
Failures0

Tests

test_module

Test case:[libs/SuperLU_DIST] Verify SUPERLU_DIST module is loaded and matches rpm version (gnu16/mpich)
Outcome:Passed
Duration:0.236 sec
Test case:[libs/SuperLU_DIST] Verify SUPERLU_DIST_DIR is defined and directory exists (gnu16/mpich)
Outcome:Passed
Duration:0.018 sec
Test case:[libs/SuperLU_DIST] Verify module SUPERLU_DIST_LIB is defined and exists (gnu16/mpich)
Outcome:Passed
Duration:0.02 sec
Test case:[libs/SuperLU_DIST] Verify dynamic library available in SUPERLU_DIST_LIB (gnu16/mpich)
Outcome:Passed
Duration:0.021 sec
Test case:[libs/SuperLU_DIST] Verify static library is not present in SUPERLU_DIST_LIB (gnu16/mpich)
Outcome:Passed
Duration:0.021 sec
Test case:[libs/SuperLU_DIST] Verify module SUPERLU_DIST_INC is defined and exists (gnu16/mpich)
Outcome:Passed
Duration:0.021 sec
Test case:[libs/SuperLU_DIST] Verify header file is present in SUPERLU_DIST_INC (gnu16/mpich)
Outcome:Passed
Duration:0.021 sec

Test Suite: rm_execution

Results

Duration0.0 sec
Tests1
Failures1

Tests

rm_execution

Test case:
Outcome:Failed
Duration:0.0 sec
Failed
(from function `ERROR' in file ../../../common/functions, line 11,
 from function `check_rms' in file ../../../common/functions, line 35,
 from function `setup_file' in test file rm_execution, line 18)
  `check_rms' failed with status 0
[OHPC-TEST:ERROR]: Unsupported or unknown resource manager

Test Suite: rm_execution

Results

Duration0.0 sec
Tests1
Failures1

Tests

rm_execution

Test case:
Outcome:Failed
Duration:0.0 sec
Failed
(from function `ERROR' in file ../../../common/functions, line 11,
 from function `check_rms' in file ../../../common/functions, line 35,
 from function `setup_file' in test file rm_execution, line 18)
  `check_rms' failed with status 0
[OHPC-TEST:ERROR]: Unsupported or unknown resource manager

Test Suite: lmod_installed

Results

Duration0.04 sec
Tests1
Failures0

Tests

lmod_installed

Test case:[modules] Check if lmod RPM installed
Outcome:Passed
Duration:0.04 sec

Test Suite: interactive_commands

Results

Duration5.147 sec
Tests8
Failures0

Tests

interactive_commands

Test case:[modules] module purge
Outcome:Passed
Duration:0.169 sec
Test case:[modules] module list
Outcome:Passed
Duration:0.286 sec
Test case:[modules] module help
Outcome:Passed
Duration:0.332 sec
Test case:[modules] module load/unload
Outcome:Passed
Duration:1.794 sec
Test case:[modules] module whatis
Outcome:Passed
Duration:0.3 sec
Test case:[modules] module swap
Outcome:Passed
Duration:0.691 sec
Test case:[modules] path updated
Outcome:Passed
Duration:0.931 sec
Test case:[modules] module depends-on
Outcome:Passed
Duration:0.644 sec

Test Suite: man_page_check

Results

Duration0.102 sec
Tests1
Failures0

Tests

man_page_check

Test case:[MPI] mpicc man page available (gnu16/mpich)
Outcome:Passed
Duration:0.102 sec

Test Suite: rm_execution_multi_host

Results

Duration0.0 sec
Tests1
Failures1

Tests

rm_execution_multi_host

Test case:
Outcome:Failed
Duration:0.0 sec
Failed
(from function `ERROR' in file ../../common/functions, line 11,
 from function `check_rms' in file ../../common/functions, line 35,
 from function `setup_file' in test file rm_execution_multi_host, line 17)
  `check_rms' failed with status 0
[OHPC-TEST:ERROR]: Unsupported or unknown resource manager

Test Suite: rm_execution_single_host

Results

Duration0.0 sec
Tests1
Failures1

Tests

rm_execution_single_host

Test case:
Outcome:Failed
Duration:0.0 sec
Failed
(from function `ERROR' in file ../../common/functions, line 11,
 from function `check_rms' in file ../../common/functions, line 35,
 from function `setup_file' in test file rm_execution_single_host, line 17)
  `check_rms' failed with status 0
[OHPC-TEST:ERROR]: Unsupported or unknown resource manager

Test Suite: version_match

Results

Duration0.486 sec
Tests3
Failures0

Tests

version_match

Test case:[MPI] MPI module loaded (gnu16/mpich)
Outcome:Passed
Duration:0.15 sec
Test case:[MPI] MPI module version available (gnu16/mpich)
Outcome:Passed
Duration:0.147 sec
Test case:[MPI] mpicc, mpicxx, and mpif90 versions match module (gnu16/mpich)
Outcome:Passed
Duration:0.189 sec

Test Suite: man_page_check

Results

Duration0.095 sec
Tests1
Failures0

Tests

man_page_check

Test case:[MPI] mpicc man page available (gnu16/mvapich2)
Outcome:Passed
Duration:0.095 sec

Test Suite: rm_execution_multi_host

Results

Duration0.0 sec
Tests1
Failures1

Tests

rm_execution_multi_host

Test case:
Outcome:Failed
Duration:0.0 sec
Failed
(from function `ERROR' in file ../../common/functions, line 11,
 from function `check_rms' in file ../../common/functions, line 35,
 from function `setup_file' in test file rm_execution_multi_host, line 17)
  `check_rms' failed with status 0
[OHPC-TEST:ERROR]: Unsupported or unknown resource manager

Test Suite: rm_execution_single_host

Results

Duration0.0 sec
Tests1
Failures1

Tests

rm_execution_single_host

Test case:
Outcome:Failed
Duration:0.0 sec
Failed
(from function `ERROR' in file ../../common/functions, line 11,
 from function `check_rms' in file ../../common/functions, line 35,
 from function `setup_file' in test file rm_execution_single_host, line 17)
  `check_rms' failed with status 0
[OHPC-TEST:ERROR]: Unsupported or unknown resource manager

Test Suite: version_match

Results

Duration0.477 sec
Tests3
Failures0

Tests

version_match

Test case:[MPI] MPI module loaded (gnu16/mvapich2)
Outcome:Passed
Duration:0.152 sec
Test case:[MPI] MPI module version available (gnu16/mvapich2)
Outcome:Passed
Duration:0.147 sec
Test case:[MPI] mpicc, mpicxx, and mpif90 versions match module (gnu16/mvapich2)
Outcome:Passed
Duration:0.178 sec

Test Suite: conman

Results

Duration0.127 sec
Tests3
Failures0

Tests

conman

Test case:[ConMan] Verify conman binary available
Outcome:Passed
Duration:0.024 sec
Test case:[ConMan] Verify rpm version matches binary
Outcome:Passed
Duration:0.058 sec
Test case:[ConMan] Verify man page availability
Outcome:Passed
Duration:0.045 sec

Test Suite: warewulf-ipmi

Results

Duration0.0 sec
Tests1
Failures0

Tests

warewulf-ipmi

Test case:[warewulf-ipmi] ipmitool lanplus protocol
Outcome:Skipped
Duration:0.0 sec
Skipped
Warewulf not installed, skipping warewulf-ipmitool check

Test Suite: test_module

Results

Duration2.625 sec
Tests6
Failures0

Tests

test_module

Test case:[perf-tools/Dimemas] Verify dimemas module is loaded and matches rpm version (gnu16/mpich)
Outcome:Passed
Duration:0.218 sec
Test case:[perf-tools/Dimemas] Verify DIMEMAS_DIR is defined and exists (gnu16/mpich)
Outcome:Passed
Duration:0.019 sec
Test case:[perf-tools/Dimemas] Verify DIMEMAS_BIN is defined and exists (gnu16/mpich)
Outcome:Passed
Duration:0.021 sec
Test case:[perf-tools/Dimemas] Verify availability of prv2dim binary (gnu16/mpich)
Outcome:Passed
Duration:0.028 sec
Test case:[perf-tools/Dimemas] Verify availability of Dimemas binary (gnu16/mpich)
Outcome:Passed
Duration:0.027 sec
Test case:[perf-tools/Dimemas] Run Dimemas simulation (gnu16/mpich)
Outcome:Passed
Duration:2.312 sec

Test Suite: test_module

Results

Duration2.607 sec
Tests6
Failures0

Tests

test_module

Test case:[perf-tools/Dimemas] Verify dimemas module is loaded and matches rpm version (gnu16/mvapich2)
Outcome:Passed
Duration:0.218 sec
Test case:[perf-tools/Dimemas] Verify DIMEMAS_DIR is defined and exists (gnu16/mvapich2)
Outcome:Passed
Duration:0.021 sec
Test case:[perf-tools/Dimemas] Verify DIMEMAS_BIN is defined and exists (gnu16/mvapich2)
Outcome:Passed
Duration:0.019 sec
Test case:[perf-tools/Dimemas] Verify availability of prv2dim binary (gnu16/mvapich2)
Outcome:Passed
Duration:0.026 sec
Test case:[perf-tools/Dimemas] Verify availability of Dimemas binary (gnu16/mvapich2)
Outcome:Passed
Duration:0.027 sec
Test case:[perf-tools/Dimemas] Run Dimemas simulation (gnu16/mvapich2)
Outcome:Passed
Duration:2.296 sec

Test Suite: test_module

Results

Duration2.631 sec
Tests6
Failures0

Tests

test_module

Test case:[perf-tools/Dimemas] Verify dimemas module is loaded and matches rpm version (gnu16/openmpi5)
Outcome:Passed
Duration:0.223 sec
Test case:[perf-tools/Dimemas] Verify DIMEMAS_DIR is defined and exists (gnu16/openmpi5)
Outcome:Passed
Duration:0.022 sec
Test case:[perf-tools/Dimemas] Verify DIMEMAS_BIN is defined and exists (gnu16/openmpi5)
Outcome:Passed
Duration:0.022 sec
Test case:[perf-tools/Dimemas] Verify availability of prv2dim binary (gnu16/openmpi5)
Outcome:Passed
Duration:0.026 sec
Test case:[perf-tools/Dimemas] Verify availability of Dimemas binary (gnu16/openmpi5)
Outcome:Passed
Duration:0.028 sec
Test case:[perf-tools/Dimemas] Run Dimemas simulation (gnu16/openmpi5)
Outcome:Passed
Duration:2.31 sec

Test Suite: test_module

Results

Duration0.223 sec
Tests3
Failures0

Tests

test_module

Test case:[IMB] Verify IMB module is loaded and matches rpm version (gnu16-mpich)
Outcome:Passed
Duration:0.2 sec
Test case:[IMB] Verify IMB_DIR is defined and directory exists (gnu16-mpich)
Outcome:Passed
Duration:0.01 sec
Test case:[IMB] Verify executables are present in IMB_DIR/bin (gnu16-mpich)
Outcome:Passed
Duration:0.013 sec

Test Suite: test_module

Results

Duration0.219 sec
Tests3
Failures0

Tests

test_module

Test case:[IMB] Verify IMB module is loaded and matches rpm version (gnu16-mvapich2)
Outcome:Passed
Duration:0.196 sec
Test case:[IMB] Verify IMB_DIR is defined and directory exists (gnu16-mvapich2)
Outcome:Passed
Duration:0.009 sec
Test case:[IMB] Verify executables are present in IMB_DIR/bin (gnu16-mvapich2)
Outcome:Passed
Duration:0.014 sec

Test Suite: rm_execution

Results

Duration0.0 sec
Tests1
Failures1

Tests

rm_execution

Test case:
Outcome:Failed
Duration:0.0 sec
Failed
(from function `ERROR' in file ./common/functions, line 11,
 from function `check_rms' in file ./common/functions, line 35,
 from function `setup_file' in test file rm_execution, line 15)
  `check_rms' failed with status 0
[OHPC-TEST:ERROR]: Unsupported or unknown resource manager

Test Suite: test_module

Results

Duration0.379 sec
Tests7
Failures0

Tests

test_module

Test case:[OMB] Verify OMB module is loaded and matches rpm version (gnu16-mpich)
Outcome:Passed
Duration:0.205 sec
Test case:[OMB] Verify OMB_DIR is defined and directory exists (gnu16-mpich)
Outcome:Passed
Duration:0.021 sec
Test case:[OMB] Verify osu_bw binary is available (gnu16-mpich)
Outcome:Passed
Duration:0.03 sec
Test case:[OMB] Verify osu_latency binary is available (gnu16-mpich)
Outcome:Passed
Duration:0.031 sec
Test case:[OMB] Verify osu_allgather binary is available (gnu16-mpich)
Outcome:Passed
Duration:0.031 sec
Test case:[OMB] Verify osu_get_bw binary is available (gnu16-mpich)
Outcome:Passed
Duration:0.029 sec
Test case:[OMB] Verify osu_put_latency binary is available (gnu16-mpich)
Outcome:Passed
Duration:0.032 sec

Test Suite: rm_execution

Results

Duration0.0 sec
Tests1
Failures1

Tests

rm_execution

Test case:
Outcome:Failed
Duration:0.0 sec
Failed
(from function `ERROR' in file ./common/functions, line 11,
 from function `check_rms' in file ./common/functions, line 35,
 from function `setup_file' in test file rm_execution, line 15)
  `check_rms' failed with status 0
[OHPC-TEST:ERROR]: Unsupported or unknown resource manager

Test Suite: test_module

Results

Duration0.379 sec
Tests7
Failures0

Tests

test_module

Test case:[OMB] Verify OMB module is loaded and matches rpm version (gnu16-mvapich2)
Outcome:Passed
Duration:0.21 sec
Test case:[OMB] Verify OMB_DIR is defined and directory exists (gnu16-mvapich2)
Outcome:Passed
Duration:0.019 sec
Test case:[OMB] Verify osu_bw binary is available (gnu16-mvapich2)
Outcome:Passed
Duration:0.03 sec
Test case:[OMB] Verify osu_latency binary is available (gnu16-mvapich2)
Outcome:Passed
Duration:0.029 sec
Test case:[OMB] Verify osu_allgather binary is available (gnu16-mvapich2)
Outcome:Passed
Duration:0.029 sec
Test case:[OMB] Verify osu_get_bw binary is available (gnu16-mvapich2)
Outcome:Passed
Duration:0.03 sec
Test case:[OMB] Verify osu_put_latency binary is available (gnu16-mvapich2)
Outcome:Passed
Duration:0.032 sec

Test Suite: rm_execution

Results

Duration0.0 sec
Tests1
Failures1

Tests

rm_execution

Test case:
Outcome:Failed
Duration:0.0 sec
Failed
(from function `ERROR' in file ./common/functions, line 11,
 from function `check_rms' in file ./common/functions, line 35,
 from function `setup_file' in test file rm_execution, line 15)
  `check_rms' failed with status 0
[OHPC-TEST:ERROR]: Unsupported or unknown resource manager

Test Suite: test_module

Results

Duration0.398 sec
Tests7
Failures0

Tests

test_module

Test case:[OMB] Verify OMB module is loaded and matches rpm version (gnu16-openmpi5)
Outcome:Passed
Duration:0.226 sec
Test case:[OMB] Verify OMB_DIR is defined and directory exists (gnu16-openmpi5)
Outcome:Passed
Duration:0.018 sec
Test case:[OMB] Verify osu_bw binary is available (gnu16-openmpi5)
Outcome:Passed
Duration:0.031 sec
Test case:[OMB] Verify osu_latency binary is available (gnu16-openmpi5)
Outcome:Passed
Duration:0.032 sec
Test case:[OMB] Verify osu_allgather binary is available (gnu16-openmpi5)
Outcome:Passed
Duration:0.031 sec
Test case:[OMB] Verify osu_get_bw binary is available (gnu16-openmpi5)
Outcome:Passed
Duration:0.031 sec
Test case:[OMB] Verify osu_put_latency binary is available (gnu16-openmpi5)
Outcome:Passed
Duration:0.029 sec

Test Suite: rm_execution

Results

Duration0.0 sec
Tests1
Failures1

Tests

rm_execution

Test case:
Outcome:Failed
Duration:0.0 sec
Failed
(from function `ERROR' in file ../../../common/functions, line 11,
 from function `check_rms' in file ../../../common/functions, line 35,
 from function `setup_file' in test file rm_execution, line 17)
  `check_rms' failed with status 0
[OHPC-TEST:ERROR]: Unsupported or unknown resource manager

Test Suite: test_module

Results

Duration0.402 sec
Tests9
Failures0

Tests

test_module

Test case:[perf-tools/Paraver] Verify paraver module is loaded and matches rpm version
Outcome:Passed
Duration:0.213 sec
Test case:[perf-tools/Paraver] Verify PARAVER_DIR is defined and exists
Outcome:Passed
Duration:0.021 sec
Test case:[perf-tools/Paraver] Verify PARAVER_BIN is defined and exists
Outcome:Passed
Duration:0.02 sec
Test case:[perf-tools/Paraver] Verify availability of paramedir binary
Outcome:Passed
Duration:0.026 sec
Test case:[perf-tools/Paraver] Verify availability of wxparaver binary
Outcome:Passed
Duration:0.028 sec
Test case:[perf-tools/Paraver] Verify availability of prvstats binary
Outcome:Passed
Duration:0.027 sec
Test case:[perf-tools/Paraver] Verify availability of prvmerger binary
Outcome:Passed
Duration:0.027 sec
Test case:[perf-tools/Paraver] Verify PARAVER_LIB is defined and exists
Outcome:Passed
Duration:0.02 sec
Test case:[perf-tools/Paraver] Verify PARAVER_INC is defined and exists
Outcome:Passed
Duration:0.02 sec

Test Suite: rm_execution

Results

Duration0.0 sec
Tests1
Failures1

Tests

rm_execution

Test case:
Outcome:Failed
Duration:0.0 sec
Failed
(from function `ERROR' in file ../../../common/functions, line 11,
 from function `check_rms' in file ../../../common/functions, line 35,
 from function `setup_file' in test file rm_execution, line 17)
  `check_rms' failed with status 0
[OHPC-TEST:ERROR]: Unsupported or unknown resource manager

Test Suite: test_module

Results

Duration0.412 sec
Tests9
Failures0

Tests

test_module

Test case:[perf-tools/Paraver] Verify paraver module is loaded and matches rpm version
Outcome:Passed
Duration:0.222 sec
Test case:[perf-tools/Paraver] Verify PARAVER_DIR is defined and exists
Outcome:Passed
Duration:0.021 sec
Test case:[perf-tools/Paraver] Verify PARAVER_BIN is defined and exists
Outcome:Passed
Duration:0.021 sec
Test case:[perf-tools/Paraver] Verify availability of paramedir binary
Outcome:Passed
Duration:0.027 sec
Test case:[perf-tools/Paraver] Verify availability of wxparaver binary
Outcome:Passed
Duration:0.025 sec
Test case:[perf-tools/Paraver] Verify availability of prvstats binary
Outcome:Passed
Duration:0.027 sec
Test case:[perf-tools/Paraver] Verify availability of prvmerger binary
Outcome:Passed
Duration:0.027 sec
Test case:[perf-tools/Paraver] Verify PARAVER_LIB is defined and exists
Outcome:Passed
Duration:0.021 sec
Test case:[perf-tools/Paraver] Verify PARAVER_INC is defined and exists
Outcome:Passed
Duration:0.021 sec

Test Suite: test_module

Results

Duration0.373 sec
Tests11
Failures0

Tests

test_module

Test case:[perf-tools/Scalasca] Verify scalasca module is loaded and matches rpm version (gnu16/mpich)
Outcome:Passed
Duration:0.217 sec
Test case:[perf-tools/Scalasca] Verify module SCALASCA_DIR is defined and exists (gnu16/mpich)
Outcome:Passed
Duration:0.009 sec
Test case:[perf-tools/Scalasca] Verify module SCALASCA_BIN is defined and exists (gnu16/mpich)
Outcome:Passed
Duration:0.009 sec
Test case:[perf-tools/Scalasca] Verify availability of scalasca binary (gnu16/mpich)
Outcome:Passed
Duration:0.017 sec
Test case:[perf-tools/Scalasca] Verify availability of scan binary (gnu16/mpich)
Outcome:Passed
Duration:0.016 sec
Test case:[perf-tools/Scalasca] Verify availability of scout.mpi binary (gnu16/mpich)
Outcome:Passed
Duration:0.016 sec
Test case:[perf-tools/Scalasca] Verify availability of scout.omp binary (gnu16/mpich)
Outcome:Passed
Duration:0.017 sec
Test case:[perf-tools/Scalasca] Verify availability of scout.hyb binary (gnu16/mpich)
Outcome:Passed
Duration:0.017 sec
Test case:[perf-tools/Scalasca] Verify availability of scout.ser binary (gnu16/mpich)
Outcome:Passed
Duration:0.018 sec
Test case:[perf-tools/Scalasca] Verify availability of square binary (gnu16/mpich)
Outcome:Passed
Duration:0.017 sec
Test case:[perf-tools/Scalasca] Verify availability of user guide for scalasca (gnu16/mpich)
Outcome:Passed
Duration:0.02 sec

Test Suite: test_module

Results

Duration0.374 sec
Tests11
Failures0

Tests

test_module

Test case:[perf-tools/Scalasca] Verify scalasca module is loaded and matches rpm version (gnu16/mvapich2)
Outcome:Passed
Duration:0.219 sec
Test case:[perf-tools/Scalasca] Verify module SCALASCA_DIR is defined and exists (gnu16/mvapich2)
Outcome:Passed
Duration:0.009 sec
Test case:[perf-tools/Scalasca] Verify module SCALASCA_BIN is defined and exists (gnu16/mvapich2)
Outcome:Passed
Duration:0.008 sec
Test case:[perf-tools/Scalasca] Verify availability of scalasca binary (gnu16/mvapich2)
Outcome:Passed
Duration:0.016 sec
Test case:[perf-tools/Scalasca] Verify availability of scan binary (gnu16/mvapich2)
Outcome:Passed
Duration:0.017 sec
Test case:[perf-tools/Scalasca] Verify availability of scout.mpi binary (gnu16/mvapich2)
Outcome:Passed
Duration:0.017 sec
Test case:[perf-tools/Scalasca] Verify availability of scout.omp binary (gnu16/mvapich2)
Outcome:Passed
Duration:0.017 sec
Test case:[perf-tools/Scalasca] Verify availability of scout.hyb binary (gnu16/mvapich2)
Outcome:Passed
Duration:0.017 sec
Test case:[perf-tools/Scalasca] Verify availability of scout.ser binary (gnu16/mvapich2)
Outcome:Passed
Duration:0.018 sec
Test case:[perf-tools/Scalasca] Verify availability of square binary (gnu16/mvapich2)
Outcome:Passed
Duration:0.018 sec
Test case:[perf-tools/Scalasca] Verify availability of user guide for scalasca (gnu16/mvapich2)
Outcome:Passed
Duration:0.018 sec

Test Suite: test_module

Results

Duration0.391 sec
Tests11
Failures0

Tests

test_module

Test case:[perf-tools/Scalasca] Verify scalasca module is loaded and matches rpm version (gnu16/openmpi5)
Outcome:Passed
Duration:0.228 sec
Test case:[perf-tools/Scalasca] Verify module SCALASCA_DIR is defined and exists (gnu16/openmpi5)
Outcome:Passed
Duration:0.01 sec
Test case:[perf-tools/Scalasca] Verify module SCALASCA_BIN is defined and exists (gnu16/openmpi5)
Outcome:Passed
Duration:0.008 sec
Test case:[perf-tools/Scalasca] Verify availability of scalasca binary (gnu16/openmpi5)
Outcome:Passed
Duration:0.017 sec
Test case:[perf-tools/Scalasca] Verify availability of scan binary (gnu16/openmpi5)
Outcome:Passed
Duration:0.017 sec
Test case:[perf-tools/Scalasca] Verify availability of scout.mpi binary (gnu16/openmpi5)
Outcome:Passed
Duration:0.017 sec
Test case:[perf-tools/Scalasca] Verify availability of scout.omp binary (gnu16/openmpi5)
Outcome:Passed
Duration:0.019 sec
Test case:[perf-tools/Scalasca] Verify availability of scout.hyb binary (gnu16/openmpi5)
Outcome:Passed
Duration:0.017 sec
Test case:[perf-tools/Scalasca] Verify availability of scout.ser binary (gnu16/openmpi5)
Outcome:Passed
Duration:0.018 sec
Test case:[perf-tools/Scalasca] Verify availability of square binary (gnu16/openmpi5)
Outcome:Passed
Duration:0.018 sec
Test case:[perf-tools/Scalasca] Verify availability of user guide for scalasca (gnu16/openmpi5)
Outcome:Passed
Duration:0.022 sec

Test Suite: instrumenter_test

Results

Duration0.0 sec
Tests1
Failures1

Tests

instrumenter_test

Test case:
Outcome:Failed
Duration:0.0 sec
Failed
(from function `ERROR' in file ./common/functions, line 11,
 from function `check_rms' in file ./common/functions, line 35,
 from function `setup_file' in test file instrumenter_test, line 14)
  `check_rms' failed with status 0
[OHPC-TEST:ERROR]: Unsupported or unknown resource manager

Test Suite: rm_execution

Results

Duration0.0 sec
Tests1
Failures1

Tests

rm_execution

Test case:
Outcome:Failed
Duration:0.0 sec
Failed
(from function `ERROR' in file ./common/functions, line 11,
 from function `check_rms' in file ./common/functions, line 35,
 from function `setup_file' in test file rm_execution, line 18)
  `check_rms' failed with status 0
[OHPC-TEST:ERROR]: Unsupported or unknown resource manager

Test Suite: test_module

Results

Duration0.725 sec
Tests14
Failures0

Tests

test_module

Test case:[perf-tools/Score-P] Verify scorep module is loaded and matches rpm version (gnu16/mpich)
Outcome:Passed
Duration:0.227 sec
Test case:[perf-tools/Score-P] Verify module SCOREP_DIR is defined and exists (gnu16/mpich)
Outcome:Passed
Duration:0.023 sec
Test case:[perf-tools/Score-P] Verify module SCOREP_BIN is defined and exists (gnu16/mpich)
Outcome:Passed
Duration:0.021 sec
Test case:[perf-tools/Score-P] Verify availability of scorep binary (gnu16/mpich)
Outcome:Passed
Duration:0.031 sec
Test case:[perf-tools/Score-P] Verify availability of scorep-backend-info binary (gnu16/mpich)
Outcome:Passed
Duration:0.032 sec
Test case:[perf-tools/Score-P] Verify availability of scorep-config binary (gnu16/mpich)
Outcome:Passed
Duration:0.032 sec
Test case:[perf-tools/Score-P] Verify availability of scorep-info binary (gnu16/mpich)
Outcome:Passed
Duration:0.032 sec
Test case:[perf-tools/Score-P] Verify availability of scorep-preload-init binary (gnu16/mpich)
Outcome:Passed
Duration:0.032 sec
Test case:[perf-tools/Score-P] Verify availability of scorep-score binary (gnu16/mpich)
Outcome:Passed
Duration:0.032 sec
Test case:[perf-tools/Score-P] Verify availability of scorep-wrapper binary (gnu16/mpich)
Outcome:Passed
Duration:0.031 sec
Test case:[perf-tools/Score-P] Verify availability of scorep wrapper binaries (gnu16/mpich)
Outcome:Passed
Duration:0.13 sec
Test case:[perf-tools/Score-P] Verify availability of user guide for scorep (gnu16/mpich)
Outcome:Passed
Duration:0.034 sec
Test case:[perf-tools/Score-P] Verify availability of OPEN_ISSUES for scorep (gnu16/mpich)
Outcome:Passed
Duration:0.034 sec
Test case:[perf-tools/Score-P] Verify availability of README.LICENSES.md for scorep (gnu16/mpich)
Outcome:Passed
Duration:0.034 sec

Test Suite: instrumenter_test

Results

Duration0.0 sec
Tests1
Failures1

Tests

instrumenter_test

Test case:
Outcome:Failed
Duration:0.0 sec
Failed
(from function `ERROR' in file ./common/functions, line 11,
 from function `check_rms' in file ./common/functions, line 35,
 from function `setup_file' in test file instrumenter_test, line 14)
  `check_rms' failed with status 0
[OHPC-TEST:ERROR]: Unsupported or unknown resource manager

Test Suite: rm_execution

Results

Duration0.0 sec
Tests1
Failures1

Tests

rm_execution

Test case:
Outcome:Failed
Duration:0.0 sec
Failed
(from function `ERROR' in file ./common/functions, line 11,
 from function `check_rms' in file ./common/functions, line 35,
 from function `setup_file' in test file rm_execution, line 18)
  `check_rms' failed with status 0
[OHPC-TEST:ERROR]: Unsupported or unknown resource manager

Test Suite: test_module

Results

Duration0.719 sec
Tests14
Failures0

Tests

test_module

Test case:[perf-tools/Score-P] Verify scorep module is loaded and matches rpm version (gnu16/mvapich2)
Outcome:Passed
Duration:0.229 sec
Test case:[perf-tools/Score-P] Verify module SCOREP_DIR is defined and exists (gnu16/mvapich2)
Outcome:Passed
Duration:0.021 sec
Test case:[perf-tools/Score-P] Verify module SCOREP_BIN is defined and exists (gnu16/mvapich2)
Outcome:Passed
Duration:0.021 sec
Test case:[perf-tools/Score-P] Verify availability of scorep binary (gnu16/mvapich2)
Outcome:Passed
Duration:0.033 sec
Test case:[perf-tools/Score-P] Verify availability of scorep-backend-info binary (gnu16/mvapich2)
Outcome:Passed
Duration:0.032 sec
Test case:[perf-tools/Score-P] Verify availability of scorep-config binary (gnu16/mvapich2)
Outcome:Passed
Duration:0.031 sec
Test case:[perf-tools/Score-P] Verify availability of scorep-info binary (gnu16/mvapich2)
Outcome:Passed
Duration:0.031 sec
Test case:[perf-tools/Score-P] Verify availability of scorep-preload-init binary (gnu16/mvapich2)
Outcome:Passed
Duration:0.031 sec
Test case:[perf-tools/Score-P] Verify availability of scorep-score binary (gnu16/mvapich2)
Outcome:Passed
Duration:0.03 sec
Test case:[perf-tools/Score-P] Verify availability of scorep-wrapper binary (gnu16/mvapich2)
Outcome:Passed
Duration:0.031 sec
Test case:[perf-tools/Score-P] Verify availability of scorep wrapper binaries (gnu16/mvapich2)
Outcome:Passed
Duration:0.131 sec
Test case:[perf-tools/Score-P] Verify availability of user guide for scorep (gnu16/mvapich2)
Outcome:Passed
Duration:0.033 sec
Test case:[perf-tools/Score-P] Verify availability of OPEN_ISSUES for scorep (gnu16/mvapich2)
Outcome:Passed
Duration:0.032 sec
Test case:[perf-tools/Score-P] Verify availability of README.LICENSES.md for scorep (gnu16/mvapich2)
Outcome:Passed
Duration:0.033 sec

Test Suite: instrumenter_test

Results

Duration0.0 sec
Tests1
Failures1

Tests

instrumenter_test

Test case:
Outcome:Failed
Duration:0.0 sec
Failed
(from function `ERROR' in file ./common/functions, line 11,
 from function `check_rms' in file ./common/functions, line 35,
 from function `setup_file' in test file instrumenter_test, line 14)
  `check_rms' failed with status 0
[OHPC-TEST:ERROR]: Unsupported or unknown resource manager

Test Suite: rm_execution

Results

Duration0.0 sec
Tests1
Failures1

Tests

rm_execution

Test case:
Outcome:Failed
Duration:0.0 sec
Failed
(from function `ERROR' in file ./common/functions, line 11,
 from function `check_rms' in file ./common/functions, line 35,
 from function `setup_file' in test file rm_execution, line 18)
  `check_rms' failed with status 0
[OHPC-TEST:ERROR]: Unsupported or unknown resource manager

Test Suite: test_module

Results

Duration0.758 sec
Tests14
Failures0

Tests

test_module

Test case:[perf-tools/Score-P] Verify scorep module is loaded and matches rpm version (gnu16/openmpi5)
Outcome:Passed
Duration:0.228 sec
Test case:[perf-tools/Score-P] Verify module SCOREP_DIR is defined and exists (gnu16/openmpi5)
Outcome:Passed
Duration:0.022 sec
Test case:[perf-tools/Score-P] Verify module SCOREP_BIN is defined and exists (gnu16/openmpi5)
Outcome:Passed
Duration:0.019 sec
Test case:[perf-tools/Score-P] Verify availability of scorep binary (gnu16/openmpi5)
Outcome:Passed
Duration:0.032 sec
Test case:[perf-tools/Score-P] Verify availability of scorep-backend-info binary (gnu16/openmpi5)
Outcome:Passed
Duration:0.032 sec
Test case:[perf-tools/Score-P] Verify availability of scorep-config binary (gnu16/openmpi5)
Outcome:Passed
Duration:0.032 sec
Test case:[perf-tools/Score-P] Verify availability of scorep-info binary (gnu16/openmpi5)
Outcome:Passed
Duration:0.031 sec
Test case:[perf-tools/Score-P] Verify availability of scorep-preload-init binary (gnu16/openmpi5)
Outcome:Passed
Duration:0.031 sec
Test case:[perf-tools/Score-P] Verify availability of scorep-score binary (gnu16/openmpi5)
Outcome:Passed
Duration:0.032 sec
Test case:[perf-tools/Score-P] Verify availability of scorep-wrapper binary (gnu16/openmpi5)
Outcome:Passed
Duration:0.032 sec
Test case:[perf-tools/Score-P] Verify availability of scorep wrapper binaries (gnu16/openmpi5)
Outcome:Passed
Duration:0.168 sec
Test case:[perf-tools/Score-P] Verify availability of user guide for scorep (gnu16/openmpi5)
Outcome:Passed
Duration:0.034 sec
Test case:[perf-tools/Score-P] Verify availability of OPEN_ISSUES for scorep (gnu16/openmpi5)
Outcome:Passed
Duration:0.032 sec
Test case:[perf-tools/Score-P] Verify availability of README.LICENSES.md for scorep (gnu16/openmpi5)
Outcome:Passed
Duration:0.033 sec

Test Suite: test_harness

Results

Duration0.0 sec
Tests1
Failures1

Tests

test_harness

Test case:
Outcome:Failed
Duration:0.0 sec
Failed
(from function `ERROR' in file ../../common/functions, line 11,
 from function `check_rms' in file ../../common/functions, line 35,
 from function `setup_file' in test file test_harness, line 12)
  `check_rms' failed with status 0
[OHPC-TEST:ERROR]: Unsupported or unknown resource manager

Test Suite: test_harness

Results

Duration0.0 sec
Tests1
Failures1

Tests

test_harness

Test case:
Outcome:Failed
Duration:0.0 sec
Failed
(from function `ERROR' in file ../../common/functions, line 11,
 from function `check_rms' in file ../../common/functions, line 35,
 from function `setup_file' in test file test_harness, line 12)
  `check_rms' failed with status 0
[OHPC-TEST:ERROR]: Unsupported or unknown resource manager

Test Suite: completion

Results

Duration0.078 sec
Tests1
Failures0

Tests

completion

Test case:[singularity] check for bash completion
Outcome:Passed
Duration:0.078 sec

Test Suite: mem_limits

Results

Duration0.037 sec
Tests2
Failures2

Tests

mem_limits

Test case:[memlock] check increased soft limit
Outcome:Failed
Duration:0.018 sec
Failed
(from function `ERROR' in file ../common/functions, line 11,
 from function `check_rms' in file ../common/functions, line 35,
 from function `setup' in test file mem_limits, line 18)
  `check_rms' failed
[OHPC-TEST:ERROR]: Unsupported or unknown resource manager
Test case:[memlock] check increased hard limit
Outcome:Failed
Duration:0.019 sec
Failed
(from function `ERROR' in file ../common/functions, line 11,
 from function `check_rms' in file ../common/functions, line 35,
 from function `setup' in test file mem_limits, line 18)
  `check_rms' failed
[OHPC-TEST:ERROR]: Unsupported or unknown resource manager

Test Suite: pdsh

Results

Duration0.0 sec
Tests1
Failures1

Tests

pdsh

Test case:
Outcome:Failed
Duration:0.0 sec
Failed
(from function `ERROR' in file ../common/functions, line 11,
 from function `check_rms' in file ../common/functions, line 35,
 from function `setup_file' in test file pdsh, line 12)
  `check_rms' failed with status 0
[OHPC-TEST:ERROR]: Unsupported or unknown resource manager

Test Suite: ompi_info

Results

Duration0.493 sec
Tests1
Failures1

Tests

ompi_info

Test case:[openmpi] check for no output to stderr with ompi_info
Outcome:Failed
Duration:0.493 sec
Failed
(in test file ompi_info, line 33)
  `ompi_info >/dev/null 2>"${OUTPUT}"' failed with status 127

Test Suite: magpie

Results

Duration0.0 sec
Tests1
Failures1

Tests

magpie

Test case:
Outcome:Failed
Duration:0.0 sec
Failed
(from function `ERROR' in file ../common/functions, line 11,
 from function `check_rms' in file ../common/functions, line 35,
 from function `setup_file' in test file magpie, line 12)
  `check_rms' failed with status 0
[OHPC-TEST:ERROR]: Unsupported or unknown resource manager

Test Suite: munge

Results

Duration1.104 sec
Tests4
Failures0

Tests

munge

Test case:[munge] check for OS provdied RPM
Outcome:Passed
Duration:0.046 sec
Test case:[munge] Generate a credential
Outcome:Passed
Duration:0.019 sec
Test case:[munge] Decode credential locally
Outcome:Passed
Duration:0.017 sec
Test case:[munge] Run benchmark
Outcome:Passed
Duration:1.022 sec

Test Suite: sacct

Results

Duration0.0 sec
Tests1
Failures0

Tests

sacct

Test case:[slurm] check for working sacct
Outcome:Skipped
Duration:0.0 sec
Skipped
Temporarily skip sacct check