<?xml version="1.0" encoding="utf-8"?>
<testsuites duration="685.853"><testsuite name="run" time="2.149"><testcase name="[dev-tools/cmake] running cmake --system-information" classname="run" time="0.878" /><testcase name="[dev-tools/cmake] run cmake" classname="run" time="0.435" /><testcase name="[dev-tools/cmake] run make on generated Makefile" classname="run" time="0.826" /><testcase name="[dev-tools/cmake] run compiled binary" classname="run" time="0.01" /></testsuite><testsuite name="computes_installed.bats" time="2.83"><testcase name="num_computes is greater than zero" classname="computes_installed.bats" time="0.019" /><testcase name="koomie_cf command is available" classname="computes_installed.bats" time="0.02" /><testcase name="get uptime from compute nodes produces results" classname="computes_installed.bats" time="1.093" /><testcase name="correct number of compute hosts respond" classname="computes_installed.bats" time="0.59" /><testcase name="verify boot times are reasonable" classname="computes_installed.bats" time="1.108" /></testsuite><testsuite name="sms_installed.bats" time="0.03"><testcase name="Verify hostname matches expectations" classname="sms_installed.bats" time="0.013" /><testcase name="Base OS check" classname="sms_installed.bats" time="0.017" /></testsuite><testsuite name="clustershell" time="1.094"><testcase name="[clush] check for OS-provided RPM" classname="clustershell" time="0.05" /><testcase name="[clush] clush -Sg compute" classname="clustershell" time="1.044" /></testsuite><testsuite name="conman" time="0.063"><testcase name="[conman] check for RPM" classname="conman" time="0.045" /><testcase name="[conman] query conmand conman" classname="conman" time="0.018" /></testsuite><testsuite name="genders" time="0.061"><testcase name="[genders] check for RPM" classname="genders" time="0.044" /><testcase name="[genders] check node attributes" classname="genders" time="0.017" /></testsuite><testsuite name="nhc" time="3.669"><testcase name="[nhc] check for RPM" classname="nhc" time="0.046" /><testcase name="[nhc] generate config file" classname="nhc" time="1.214" /><testcase name="[nhc] service failure detection and restart" classname="nhc" time="2.409" /></testsuite><testsuite name="prun" time="0.111"><testcase name="[prun] unsupported MPI family exits non-zero" classname="prun" time="0.024"><failure message="">(in test file prun, line 14)
  `[[ "$output" == *"Unsupported or unknown MPI family"* ]]' failed</failure></testcase><testcase name="[prun] mpich with an unknown resource manager exits non-zero" classname="prun" time="0.018"><failure message="">(in test file prun, line 20)
  `[[ "$output" == *"Unknown resource manager"* ]]' failed</failure></testcase><testcase name="[prun] openmpi with an unknown resource manager exits non-zero" classname="prun" time="0.018"><failure message="">(in test file prun, line 26)
  `[[ "$output" == *"Unknown resource manager"* ]]' failed</failure></testcase><testcase name="[prun] mvapich2 with an unknown resource manager exits non-zero" classname="prun" time="0.028"><failure message="">(in test file prun, line 34)
  `[[ "$output" == *"Unknown resource manager"* ]]' failed</failure></testcase><testcase name="[prun] impi with an unknown resource manager exits non-zero" classname="prun" time="0.023"><failure message="">(in test file prun, line 40)
  `[[ "$output" == *"Unknown resource manager"* ]]' failed</failure></testcase></testsuite><testsuite name="slurm-plugins" time="1.507"><testcase name="[slurm] check for jobcomp_elasticsearch plugin" classname="slurm-plugins" time="0.064"><failure message="">(from function `assert_success' in file ./common/test_helper_functions.bash, line 58,
 in test file slurm-plugins, line 13)
  `assert_success' failed

-- command failed --
status : 2
output : ls: cannot access '/usr/lib64/slurm/jobcomp_elasticsearch.so': No such file or directory
--</failure></testcase><testcase name="[slurm] check for job_submit_lua plugin" classname="slurm-plugins" time="0.063"><failure message="">(from function `assert_success' in file ./common/test_helper_functions.bash, line 58,
 in test file slurm-plugins, line 18)
  `assert_success' failed

-- command failed --
status : 2
output : ls: cannot access '/usr/lib64/slurm/job_submit_lua.so': No such file or directory
--</failure></testcase><testcase name="[slurm] check for --x11 option" classname="slurm-plugins" time="0.037"><failure message="">(from function `assert_equal' in file ./common/test_helper_functions.bash, line 38,
 from function `assert_output' in file ./common/test_helper_functions.bash, line 49,
 in test file slurm-plugins, line 23)
  `assert_output "srun: error: No DISPLAY variable set, cannot setup x11 forwarding."' failed
output expected: srun: error: No DISPLAY variable set, cannot setup x11 forwarding.
output observed: /usr/lib/bats-core/test_functions.bash: line 166: srun: command not found</failure></testcase><testcase name="[slurm] check for sview rpm availability" classname="slurm-plugins" time="1.343" /></testsuite><testsuite name="lmod" time="0.43"><testcase name="[lmod] test that the setup function passed" classname="lmod" time="0.43" /></testsuite><testsuite name="spack" time="29.284"><testcase name="[spack] check for RPM" classname="spack" time="0.599" /><testcase name="[spack] add compiler" classname="spack" time="11.347" /><testcase name="[spack] test build" classname="spack" time="16.242" /><testcase name="[spack] test module refresh" classname="spack" time="1.096" /></testsuite><testsuite name="build" time="6.82"><testcase name="[/apps/hpcg] build HPCG executable (gnu16/mpich)" classname="build" time="6.82" /></testsuite><testsuite name="build" time="8.193"><testcase name="[/apps/hpcg] build HPCG executable (gnu16/mvapich2)" classname="build" time="8.193" /></testsuite><testsuite name="build" time="0.065"><testcase name="[/apps/hpcg] build HPCG executable (gnu16/openmpi5)" classname="build" time="0.065"><failure message="">(in test file build, line 19)
  `make -f Makefile.ohpc -j 4' failed with status 2
rm -f src/*.o bin/xhpcg
mpicxx  -I./src -I./src/UNKNOWN  -DMPICH_IGNORE_CXX_SEEK -O3 -ffast-math -ftree-vectorize -ftree-vectorizer-verbose=0 -fopenmp   -c -o src/main.o src/main.cpp
mpicxx  -I./src -I./src/UNKNOWN  -DMPICH_IGNORE_CXX_SEEK -O3 -ffast-math -ftree-vectorize -ftree-vectorizer-verbose=0 -fopenmp   -c -o src/CG.o src/CG.cpp
mpicxx: error while loading shared libraries: libpmix.so.2: cannot open shared object file: No such file or directory
make[4]: *** [&lt;builtin&gt;: src/main.o] Error 127
mpicxx  -I./src -I./src/UNKNOWN  -DMPICH_IGNORE_CXX_SEEK -O3 -ffast-math -ftree-vectorize -ftree-vectorizer-verbose=0 -fopenmp   -c -o src/CG_ref.o src/CG_ref.cpp
mpicxx: error while loading shared libraries: libpmix.so.2: cannot open shared object file: No such file or directory
make[4]: *** [&lt;builtin&gt;: src/CG.o] Error 127
mpicxx  -I./src -I./src/UNKNOWN  -DMPICH_IGNORE_CXX_SEEK -O3 -ffast-math -ftree-vectorize -ftree-vectorizer-verbose=0 -fopenmp   -c -o src/TestCG.o src/TestCG.cpp
mpicxx: error while loading shared libraries: libpmix.so.2: cannot open shared object file: No such file or directory
make[4]: *** [&lt;builtin&gt;: src/CG_ref.o] Error 127
mpicxx  -I./src -I./src/UNKNOWN  -DMPICH_IGNORE_CXX_SEEK -O3 -ffast-math -ftree-vectorize -ftree-vectorizer-verbose=0 -fopenmp   -c -o src/ComputeResidual.o src/ComputeResidual.cpp
mpicxx: error while loading shared libraries: libpmix.so.2: cannot open shared object file: No such file or directory
make[4]: *** [&lt;builtin&gt;: src/TestCG.o] Error 127
mpicxx  -I./src -I./src/UNKNOWN  -DMPICH_IGNORE_CXX_SEEK -O3 -ffast-math -ftree-vectorize -ftree-vectorizer-verbose=0 -fopenmp   -c -o src/ExchangeHalo.o src/ExchangeHalo.cpp
mpicxx: error while loading shared libraries: libpmix.so.2: cannot open shared object file: No such file or directory
make[4]: *** [&lt;builtin&gt;: src/ComputeResidual.o] Error 127
mpicxx  -I./src -I./src/UNKNOWN  -DMPICH_IGNORE_CXX_SEEK -O3 -ffast-math -ftree-vectorize -ftree-vectorizer-verbose=0 -fopenmp   -c -o src/GenerateGeometry.o src/GenerateGeometry.cpp
mpicxx: error while loading shared libraries: libpmix.so.2: cannot open shared object file: No such file or directory
make[4]: *** [&lt;builtin&gt;: src/ExchangeHalo.o] Error 127
mpicxx  -I./src -I./src/UNKNOWN  -DMPICH_IGNORE_CXX_SEEK -O3 -ffast-math -ftree-vectorize -ftree-vectorizer-verbose=0 -fopenmp   -c -o src/GenerateProblem.o src/GenerateProblem.cpp
mpicxx: error while loading shared libraries: libpmix.so.2: cannot open shared object file: No such file or directory
make[4]: *** [&lt;builtin&gt;: src/GenerateGeometry.o] Error 127
mpicxx  -I./src -I./src/UNKNOWN  -DMPICH_IGNORE_CXX_SEEK -O3 -ffast-math -ftree-vectorize -ftree-vectorizer-verbose=0 -fopenmp   -c -o src/GenerateProblem_ref.o src/GenerateProblem_ref.cpp
mpicxx: error while loading shared libraries: libpmix.so.2: cannot open shared object file: No such file or directory
make[4]: *** [&lt;builtin&gt;: src/GenerateProblem.o] Error 127
mpicxx  -I./src -I./src/UNKNOWN  -DMPICH_IGNORE_CXX_SEEK -O3 -ffast-math -ftree-vectorize -ftree-vectorizer-verbose=0 -fopenmp   -c -o src/CheckProblem.o src/CheckProblem.cpp
mpicxx: error while loading shared libraries: libpmix.so.2: cannot open shared object file: No such file or directory
make[4]: *** [&lt;builtin&gt;: src/GenerateProblem_ref.o] Error 127
mpicxx  -I./src -I./src/UNKNOWN  -DMPICH_IGNORE_CXX_SEEK -O3 -ffast-math -ftree-vectorize -ftree-vectorizer-verbose=0 -fopenmp   -c -o src/MixedBaseCounter.o src/MixedBaseCounter.cpp
mpicxx: error while loading shared libraries: libpmix.so.2: cannot open shared object file: No such file or directory
make[4]: *** [&lt;builtin&gt;: src/CheckProblem.o] Error 127
mpicxx  -I./src -I./src/UNKNOWN  -DMPICH_IGNORE_CXX_SEEK -O3 -ffast-math -ftree-vectorize -ftree-vectorizer-verbose=0 -fopenmp   -c -o src/OptimizeProblem.o src/OptimizeProblem.cpp
mpicxx: error while loading shared libraries: libpmix.so.2: cannot open shared object file: No such file or directory
make[4]: *** [&lt;builtin&gt;: src/MixedBaseCounter.o] Error 127
mpicxx  -I./src -I./src/UNKNOWN  -DMPICH_IGNORE_CXX_SEEK -O3 -ffast-math -ftree-vectorize -ftree-vectorizer-verbose=0 -fopenmp   -c -o src/ReadHpcgDat.o src/ReadHpcgDat.cpp
mpicxx: error while loading shared libraries: libpmix.so.2: cannot open shared object file: No such file or directory
make[4]: *** [&lt;builtin&gt;: src/OptimizeProblem.o] Error 127
mpicxx  -I./src -I./src/UNKNOWN  -DMPICH_IGNORE_CXX_SEEK -O3 -ffast-math -ftree-vectorize -ftree-vectorizer-verbose=0 -fopenmp   -c -o src/ReportResults.o src/ReportResults.cpp
mpicxx: error while loading shared libraries: libpmix.so.2: cannot open shared object file: No such file or directory
make[4]: *** [&lt;builtin&gt;: src/ReadHpcgDat.o] Error 127
mpicxx  -I./src -I./src/UNKNOWN  -DMPICH_IGNORE_CXX_SEEK -O3 -ffast-math -ftree-vectorize -ftree-vectorizer-verbose=0 -fopenmp   -c -o src/SetupHalo.o src/SetupHalo.cpp
mpicxx: error while loading shared libraries: libpmix.so.2: cannot open shared object file: No such file or directory
make[4]: *** [&lt;builtin&gt;: src/ReportResults.o] Error 127
mpicxx  -I./src -I./src/UNKNOWN  -DMPICH_IGNORE_CXX_SEEK -O3 -ffast-math -ftree-vectorize -ftree-vectorizer-verbose=0 -fopenmp   -c -o src/SetupHalo_ref.o src/SetupHalo_ref.cpp
mpicxx: error while loading shared libraries: libpmix.so.2: cannot open shared object file: No such file or directory
make[4]: *** [&lt;builtin&gt;: src/SetupHalo.o] Error 127
mpicxx  -I./src -I./src/UNKNOWN  -DMPICH_IGNORE_CXX_SEEK -O3 -ffast-math -ftree-vectorize -ftree-vectorizer-verbose=0 -fopenmp   -c -o src/TestSymmetry.o src/TestSymmetry.cpp
mpicxx: error while loading shared libraries: libpmix.so.2: cannot open shared object file: No such file or directory
make[4]: *** [&lt;builtin&gt;: src/SetupHalo_ref.o] Error 127
mpicxx  -I./src -I./src/UNKNOWN  -DMPICH_IGNORE_CXX_SEEK -O3 -ffast-math -ftree-vectorize -ftree-vectorizer-verbose=0 -fopenmp   -c -o src/TestNorms.o src/TestNorms.cpp
mpicxx: error while loading shared libraries: libpmix.so.2: cannot open shared object file: No such file or directory
make[4]: *** [&lt;builtin&gt;: src/TestSymmetry.o] Error 127
mpicxx  -I./src -I./src/UNKNOWN  -DMPICH_IGNORE_CXX_SEEK -O3 -ffast-math -ftree-vectorize -ftree-vectorizer-verbose=0 -fopenmp   -c -o src/WriteProblem.o src/WriteProblem.cpp
mpicxx: error while loading shared libraries: libpmix.so.2: cannot open shared object file: No such file or directory
make[4]: *** [&lt;builtin&gt;: src/TestNorms.o] Error 127
mpicxx  -I./src -I./src/UNKNOWN  -DMPICH_IGNORE_CXX_SEEK -O3 -ffast-math -ftree-vectorize -ftree-vectorizer-verbose=0 -fopenmp   -c -o src/YAML_Doc.o src/YAML_Doc.cpp
mpicxx: error while loading shared libraries: libpmix.so.2: cannot open shared object file: No such file or directory
make[4]: *** [&lt;builtin&gt;: src/WriteProblem.o] Error 127
mpicxx  -I./src -I./src/UNKNOWN  -DMPICH_IGNORE_CXX_SEEK -O3 -ffast-math -ftree-vectorize -ftree-vectorizer-verbose=0 -fopenmp   -c -o src/YAML_Element.o src/YAML_Element.cpp
mpicxx: error while loading shared libraries: libpmix.so.2: cannot open shared object file: No such file or directory
make[4]: *** [&lt;builtin&gt;: src/YAML_Doc.o] Error 127
mpicxx  -I./src -I./src/UNKNOWN  -DMPICH_IGNORE_CXX_SEEK -O3 -ffast-math -ftree-vectorize -ftree-vectorizer-verbose=0 -fopenmp   -c -o src/ComputeDotProduct.o src/ComputeDotProduct.cpp
mpicxx: error while loading shared libraries: libpmix.so.2: cannot open shared object file: No such file or directory
make[4]: *** [&lt;builtin&gt;: src/YAML_Element.o] Error 127
mpicxx  -I./src -I./src/UNKNOWN  -DMPICH_IGNORE_CXX_SEEK -O3 -ffast-math -ftree-vectorize -ftree-vectorizer-verbose=0 -fopenmp   -c -o src/ComputeDotProduct_ref.o src/ComputeDotProduct_ref.cpp
mpicxx: error while loading shared libraries: libpmix.so.2: cannot open shared object file: No such file or directory
make[4]: *** [&lt;builtin&gt;: src/ComputeDotProduct.o] Error 127
mpicxx  -I./src -I./src/UNKNOWN  -DMPICH_IGNORE_CXX_SEEK -O3 -ffast-math -ftree-vectorize -ftree-vectorizer-verbose=0 -fopenmp   -c -o src/mytimer.o src/mytimer.cpp
mpicxx: error while loading shared libraries: libpmix.so.2: cannot open shared object file: No such file or directory
make[4]: *** [&lt;builtin&gt;: src/ComputeDotProduct_ref.o] Error 127
mpicxx  -I./src -I./src/UNKNOWN  -DMPICH_IGNORE_CXX_SEEK -O3 -ffast-math -ftree-vectorize -ftree-vectorizer-verbose=0 -fopenmp   -c -o src/ComputeOptimalShapeXYZ.o src/ComputeOptimalShapeXYZ.cpp
mpicxx: error while loading shared libraries: libpmix.so.2: cannot open shared object file: No such file or directory
make[4]: *** [&lt;builtin&gt;: src/mytimer.o] Error 127
mpicxx  -I./src -I./src/UNKNOWN  -DMPICH_IGNORE_CXX_SEEK -O3 -ffast-math -ftree-vectorize -ftree-vectorizer-verbose=0 -fopenmp   -c -o src/ComputeSPMV.o src/ComputeSPMV.cpp
mpicxx: error while loading shared libraries: libpmix.so.2: cannot open shared object file: No such file or directory
make[4]: *** [&lt;builtin&gt;: src/ComputeOptimalShapeXYZ.o] Error 127
mpicxx  -I./src -I./src/UNKNOWN  -DMPICH_IGNORE_CXX_SEEK -O3 -ffast-math -ftree-vectorize -ftree-vectorizer-verbose=0 -fopenmp   -c -o src/ComputeSPMV_ref.o src/ComputeSPMV_ref.cpp
mpicxx: error while loading shared libraries: libpmix.so.2: cannot open shared object file: No such file or directory
make[4]: *** [&lt;builtin&gt;: src/ComputeSPMV.o] Error 127
mpicxx  -I./src -I./src/UNKNOWN  -DMPICH_IGNORE_CXX_SEEK -O3 -ffast-math -ftree-vectorize -ftree-vectorizer-verbose=0 -fopenmp   -c -o src/ComputeSYMGS.o src/ComputeSYMGS.cpp
mpicxx: error while loading shared libraries: libpmix.so.2: cannot open shared object file: No such file or directory
make[4]: *** [&lt;builtin&gt;: src/ComputeSPMV_ref.o] Error 127
mpicxx  -I./src -I./src/UNKNOWN  -DMPICH_IGNORE_CXX_SEEK -O3 -ffast-math -ftree-vectorize -ftree-vectorizer-verbose=0 -fopenmp   -c -o src/ComputeSYMGS_ref.o src/ComputeSYMGS_ref.cpp
mpicxx: error while loading shared libraries: libpmix.so.2: cannot open shared object file: No such file or directory
make[4]: *** [&lt;builtin&gt;: src/ComputeSYMGS.o] Error 127
mpicxx  -I./src -I./src/UNKNOWN  -DMPICH_IGNORE_CXX_SEEK -O3 -ffast-math -ftree-vectorize -ftree-vectorizer-verbose=0 -fopenmp   -c -o src/ComputeWAXPBY.o src/ComputeWAXPBY.cpp
mpicxx: error while loading shared libraries: libpmix.so.2: cannot open shared object file: No such file or directory
make[4]: *** [&lt;builtin&gt;: src/ComputeSYMGS_ref.o] Error 127
mpicxx  -I./src -I./src/UNKNOWN  -DMPICH_IGNORE_CXX_SEEK -O3 -ffast-math -ftree-vectorize -ftree-vectorizer-verbose=0 -fopenmp   -c -o src/ComputeWAXPBY_ref.o src/ComputeWAXPBY_ref.cpp
mpicxx: error while loading shared libraries: libpmix.so.2: cannot open shared object file: No such file or directory
make[4]: *** [&lt;builtin&gt;: src/ComputeWAXPBY.o] Error 127
mpicxx  -I./src -I./src/UNKNOWN  -DMPICH_IGNORE_CXX_SEEK -O3 -ffast-math -ftree-vectorize -ftree-vectorizer-verbose=0 -fopenmp   -c -o src/ComputeMG_ref.o src/ComputeMG_ref.cpp
mpicxx: error while loading shared libraries: libpmix.so.2: cannot open shared object file: No such file or directory
make[4]: *** [&lt;builtin&gt;: src/ComputeWAXPBY_ref.o] Error 127
mpicxx  -I./src -I./src/UNKNOWN  -DMPICH_IGNORE_CXX_SEEK -O3 -ffast-math -ftree-vectorize -ftree-vectorizer-verbose=0 -fopenmp   -c -o src/ComputeMG.o src/ComputeMG.cpp
mpicxx: error while loading shared libraries: libpmix.so.2: cannot open shared object file: No such file or directory
make[4]: *** [&lt;builtin&gt;: src/ComputeMG_ref.o] Error 127
mpicxx  -I./src -I./src/UNKNOWN  -DMPICH_IGNORE_CXX_SEEK -O3 -ffast-math -ftree-vectorize -ftree-vectorizer-verbose=0 -fopenmp   -c -o src/ComputeProlongation_ref.o src/ComputeProlongation_ref.cpp
mpicxx: error while loading shared libraries: libpmix.so.2: cannot open shared object file: No such file or directory
make[4]: *** [&lt;builtin&gt;: src/ComputeMG.o] Error 127
mpicxx  -I./src -I./src/UNKNOWN  -DMPICH_IGNORE_CXX_SEEK -O3 -ffast-math -ftree-vectorize -ftree-vectorizer-verbose=0 -fopenmp   -c -o src/ComputeRestriction_ref.o src/ComputeRestriction_ref.cpp
mpicxx: error while loading shared libraries: libpmix.so.2: cannot open shared object file: No such file or directory
make[4]: *** [&lt;builtin&gt;: src/ComputeProlongation_ref.o] Error 127
mpicxx  -I./src -I./src/UNKNOWN  -DMPICH_IGNORE_CXX_SEEK -O3 -ffast-math -ftree-vectorize -ftree-vectorizer-verbose=0 -fopenmp   -c -o src/CheckAspectRatio.o src/CheckAspectRatio.cpp
mpicxx: error while loading shared libraries: libpmix.so.2: cannot open shared object file: No such file or directory
make[4]: *** [&lt;builtin&gt;: src/ComputeRestriction_ref.o] Error 127
mpicxx  -I./src -I./src/UNKNOWN  -DMPICH_IGNORE_CXX_SEEK -O3 -ffast-math -ftree-vectorize -ftree-vectorizer-verbose=0 -fopenmp   -c -o src/GenerateCoarseProblem.o src/GenerateCoarseProblem.cpp
mpicxx: error while loading shared libraries: libpmix.so.2: cannot open shared object file: No such file or directory
make[4]: *** [&lt;builtin&gt;: src/CheckAspectRatio.o] Error 127
mpicxx  -I./src -I./src/UNKNOWN  -DMPICH_IGNORE_CXX_SEEK -O3 -ffast-math -ftree-vectorize -ftree-vectorizer-verbose=0 -fopenmp   -c -o src/init.o src/init.cpp
mpicxx: error while loading shared libraries: libpmix.so.2: cannot open shared object file: No such file or directory
make[4]: *** [&lt;builtin&gt;: src/GenerateCoarseProblem.o] Error 127
mpicxx  -I./src -I./src/UNKNOWN  -DMPICH_IGNORE_CXX_SEEK -O3 -ffast-math -ftree-vectorize -ftree-vectorizer-verbose=0 -fopenmp   -c -o src/finalize.o src/finalize.cpp
mpicxx: error while loading shared libraries: libpmix.so.2: cannot open shared object file: No such file or directory
make[4]: *** [&lt;builtin&gt;: src/init.o] Error 127
mpicxx: error while loading shared libraries: libpmix.so.2: cannot open shared object file: No such file or directory
make[4]: *** [&lt;builtin&gt;: src/finalize.o] Error 127
make[4]: Target 'all' not remade because of errors.</failure></testcase></testsuite><testsuite name="build" time="9.896"><testcase name="[Apps/miniFE] build MiniFE executable (gnu16/mpich)" classname="build" time="9.896" /></testsuite><testsuite name="build" time="14.185"><testcase name="[Apps/miniFE] build MiniFE executable (gnu16/mvapich2)" classname="build" time="14.185" /></testsuite><testsuite name="os_distribution" time="0.008"><testcase name="[BOS] OS distribution matches  (local) " classname="os_distribution" time="0.008" /></testsuite><testsuite name="computes" time="4.366"><testcase name="[BOS] OS distribution matches  (2 active computes) " classname="computes" time="0.0"><skipped message="">disable BOS_RELEASE check</skipped></testcase><testcase name="[BOS] consistent kernel (2 active computes) " classname="computes" time="1.095" /><testcase name="[BOS] increased locked memory limits " classname="computes" time="2.179" /><testcase name="[BOS] syslog forwarding " classname="computes" time="1.092" /></testsuite><testsuite name="debugger" time="0.016"><testcase name="[Compilers] debugger man page (gnu16)" classname="debugger" time="0.009" /><testcase name="[Compilers] debugger availability (gnu16)" classname="debugger" time="0.007" /></testsuite><testsuite name="man_pages" time="0.129"><testcase name="[Compilers] C compiler man/help page (gnu16)" classname="man_pages" time="0.042" /><testcase name="[Compilers] C++ compiler man/help page (gnu16)" classname="man_pages" time="0.048" /><testcase name="[Compilers] Fortran compiler man/help page (gnu16)" classname="man_pages" time="0.039" /></testsuite><testsuite name="rm_execution" time="0.0"><testcase name="" classname="rm_execution" time="0.0"><failure message="">(from function `ERROR' in file ./common/functions, line 11,
 from function `check_rms' in file ./common/functions, line 35,
 from function `setup_file' in test file rm_execution, line 13)
  `check_rms' failed with status 0
[OHPC-TEST:ERROR]: Unsupported or unknown resource manager</failure></testcase></testsuite><testsuite name="version_match" time="0.448"><testcase name="[Compilers] compiler module loaded (gnu16)" classname="version_match" time="0.133" /><testcase name="[Compilers] compiler module version available (gnu16)" classname="version_match" time="0.13" /><testcase name="[Compilers] C, C++, and Fortran versions match module (gnu16)" classname="version_match" time="0.185" /></testsuite><testsuite name="EasyBuild" time="545.125"><testcase name="[EasyBuild] check for RPM" classname="EasyBuild" time="0.233" /><testcase name="[EasyBuild] test executable" classname="EasyBuild" time="2.223" /><testcase name="[EasyBuild] test install of tmux" classname="EasyBuild" time="542.669" /></testsuite><testsuite name="test_module" time="0.24"><testcase name="[HWLOC] Verify HWLOC module is loaded and matches rpm version (gnu16/)" classname="test_module" time="0.184" /><testcase name="[HWLOC] Verify module HWLOC_DIR is defined and exists (gnu16/)" classname="test_module" time="0.011" /><testcase name="[HWLOC] Verify module HWLOC_LIB is defined and exists (gnu16/)" classname="test_module" time="0.009" /><testcase name="[HWLOC] Verify dynamic library available in HWLOC_LIB (gnu16/)" classname="test_module" time="0.009" /><testcase name="[HWLOC] Verify static library is not present in HWLOC_LIB (gnu16/)" classname="test_module" time="0.009" /><testcase name="[HWLOC] Verify module HWLOC_INC is defined and exists (gnu16/)" classname="test_module" time="0.009" /><testcase name="[HWLOC] Verify header file is present in HWLOC_INC (gnu16/)" classname="test_module" time="0.009" /></testsuite><testsuite name="test_module" time="0.027"><testcase name="[mpi4py] Verify  module is loaded and matches rpm version (gnu16/mpich)" classname="test_module" time="0.008" /><testcase name="[mpi4py] Verify module MPI4PY_DIR is defined and exists (gnu16/mpich)" classname="test_module" time="0.011" /><testcase name="[mpi4py] Verify PYTHONPATH is defined and exists (gnu16/mpich)" classname="test_module" time="0.008" /></testsuite><testsuite name="test_module" time="0.027"><testcase name="[mpi4py] Verify  module is loaded and matches rpm version (gnu16/mvapich2)" classname="test_module" time="0.008" /><testcase name="[mpi4py] Verify module MPI4PY_DIR is defined and exists (gnu16/mvapich2)" classname="test_module" time="0.011" /><testcase name="[mpi4py] Verify PYTHONPATH is defined and exists (gnu16/mvapich2)" classname="test_module" time="0.008" /></testsuite><testsuite name="test_module" time="0.029"><testcase name="[mpi4py] Verify  module is loaded and matches rpm version (gnu16/openmpi5)" classname="test_module" time="0.009" /><testcase name="[mpi4py] Verify module MPI4PY_DIR is defined and exists (gnu16/openmpi5)" classname="test_module" time="0.011" /><testcase name="[mpi4py] Verify PYTHONPATH is defined and exists (gnu16/openmpi5)" classname="test_module" time="0.009" /></testsuite><testsuite name="rm_execution" time="0.0"><testcase name="" classname="rm_execution" time="0.0"><failure message="">(from function `ERROR' in file ../../../common/functions, line 11,
 from function `check_rms' in file ../../../common/functions, line 35,
 from function `setup_file' in test file rm_execution, line 12)
  `check_rms' failed with status 0
[OHPC-TEST:ERROR]: Unsupported or unknown resource manager</failure></testcase></testsuite><testsuite name="test_module" time="0.269"><testcase name="[dev-tools/py3-numpy] Verify py3-numpy module is loaded and matches rpm version (gnu16)" classname="test_module" time="0.209" /><testcase name="[dev-tools/py3-numpy] Verify NUMPY_DIR is defined and directory exists (gnu16)" classname="test_module" time="0.02" /><testcase name="[dev-tools/py3-numpy] Verify NUMPY_BIN is defined and directory exists (gnu16)" classname="test_module" time="0.02" /><testcase name="[dev-tools/py3-numpy] Verify PYTHONPATH is defined (gnu16)" classname="test_module" time="0.02" /></testsuite><testsuite name="rm_execution" time="0.0"><testcase name="" classname="rm_execution" time="0.0"><failure message="">(from function `ERROR' in file ../../../common/functions, line 11,
 from function `check_rms' in file ../../../common/functions, line 35,
 from function `setup_file' in test file rm_execution, line 12)
  `check_rms' failed with status 0
[OHPC-TEST:ERROR]: Unsupported or unknown resource manager</failure></testcase></testsuite><testsuite name="test_module" time="1.495"><testcase name="[dev-tools/Valgrind] Verify valgrind module is loaded and matches rpm version (gnu16)" classname="test_module" time="0.21" /><testcase name="[dev-tools/Valgrind] Verify VALGRIND_DIR is defined and directory exists (gnu16)" classname="test_module" time="0.018" /><testcase name="[dev-tools/Valgrind] Verify availability of valgrind binary (gnu16)" classname="test_module" time="0.029" /><testcase name="[dev-tools/Valgrind] Verify availability of man page (gnu16)" classname="test_module" time="0.056" /><testcase name="[dev-tools/Valgrind] Verify module VALGRIND_INC is defined and exists (gnu16)" classname="test_module" time="0.019" /><testcase name="[dev-tools/Valgrind] Verify header file is present in VALGRIND_INC (gnu16)" classname="test_module" time="0.019" /><testcase name="[dev-tools/Valgrind] Callgrind test (gnu16)" classname="test_module" time="0.256" /><testcase name="[dev-tools/Valgrind] Memcheck test (gnu16)" classname="test_module" time="0.888" /></testsuite><testsuite name="test_module" time="12.677"><testcase name="[R] Verify R module is loaded and matches rpm version (gnu16)" classname="test_module" time="0.226" /><testcase name="[R] Verify R_DIR is defined and exists (gnu16)" classname="test_module" time="0.01" /><testcase name="[R] Verify availability of R executable -&gt; R (gnu16)" classname="test_module" time="0.017" /><testcase name="[R] Verify availability of R executable -&gt; Rscript (gnu16)" classname="test_module" time="0.017" /><testcase name="[R] Verify module R_SHARE is defined and exists (gnu16)" classname="test_module" time="0.01" /><testcase name="[R] Running bench.R test" classname="test_module" time="11.84" /><testcase name="[R] Verify ability to compile C code for R and execute" classname="test_module" time="0.557" /></testsuite><testsuite name="rm_execution" time="0.0"><testcase name="" classname="rm_execution" time="0.0"><failure message="">(from function `ERROR' in file ../../../common/functions, line 11,
 from function `check_rms' in file ../../../common/functions, line 35,
 from function `setup_file' in test file rm_execution, line 12)
  `check_rms' failed with status 0
[OHPC-TEST:ERROR]: Unsupported or unknown resource manager</failure></testcase></testsuite><testsuite name="test_module" time="0.359"><testcase name="[libs/adios2] Verify ADIOS2 module is loaded and matches rpm version (gnu16/mpich)" classname="test_module" time="0.234" /><testcase name="[libs/adios2] Verify module ADIOS2_DIR is defined and exists (gnu16/mpich)" classname="test_module" time="0.02" /><testcase name="[libs/adios2] Verify module ADIOS2_BIN is defined and exists (gnu16/mpich)" classname="test_module" time="0.018" /><testcase name="[libs/adios2] Verify module ADIOS2_LIB is defined and exists (gnu16/mpich)" classname="test_module" time="0.021" /><testcase name="[libs/adios2] Verify dynamic library available in ADIOS2_LIB (gnu16/mpich)" classname="test_module" time="0.026" /><testcase name="[libs/adios2] Verify module ADIOS2_INC is defined and exists (gnu16/mpich)" classname="test_module" time="0.021" /><testcase name="[libs/adios2] Verify header file is present in ADIOS2_INC (gnu16/mpich)" classname="test_module" time="0.019" /></testsuite><testsuite name="rm_execution" time="0.0"><testcase name="" classname="rm_execution" time="0.0"><failure message="">(from function `ERROR' in file ../../../common/functions, line 11,
 from function `check_rms' in file ../../../common/functions, line 35,
 from function `setup_file' in test file rm_execution, line 12)
  `check_rms' failed with status 0
[OHPC-TEST:ERROR]: Unsupported or unknown resource manager</failure></testcase></testsuite><testsuite name="test_module" time="0.355"><testcase name="[libs/adios2] Verify ADIOS2 module is loaded and matches rpm version (gnu16/mvapich2)" classname="test_module" time="0.229" /><testcase name="[libs/adios2] Verify module ADIOS2_DIR is defined and exists (gnu16/mvapich2)" classname="test_module" time="0.021" /><testcase name="[libs/adios2] Verify module ADIOS2_BIN is defined and exists (gnu16/mvapich2)" classname="test_module" time="0.02" /><testcase name="[libs/adios2] Verify module ADIOS2_LIB is defined and exists (gnu16/mvapich2)" classname="test_module" time="0.018" /><testcase name="[libs/adios2] Verify dynamic library available in ADIOS2_LIB (gnu16/mvapich2)" classname="test_module" time="0.025" /><testcase name="[libs/adios2] Verify module ADIOS2_INC is defined and exists (gnu16/mvapich2)" classname="test_module" time="0.021" /><testcase name="[libs/adios2] Verify header file is present in ADIOS2_INC (gnu16/mvapich2)" classname="test_module" time="0.021" /></testsuite><testsuite name="test_module" time="2.962"><testcase name="[BOOST] Verify BOOST module is loaded and matches rpm version (gnu16/mpich)" classname="test_module" time="0.226" /><testcase name="[BOOST] Verify module BOOST_DIR is defined and exists (gnu16/mpich)" classname="test_module" time="0.011" /><testcase name="[BOOST] Verify module BOOST_LIB is defined and exists (gnu16/mpich)" classname="test_module" time="0.008" /><testcase name="[BOOST] Verify dynamic library available in BOOST_LIB (gnu16/mpich)" classname="test_module" time="0.009" /><testcase name="[BOOST] Verify static library is not present in BOOST_LIB (gnu16/mpich)" classname="test_module" time="0.009" /><testcase name="[BOOST] Verify module BOOST_INC is defined and exists (gnu16/mpich)" classname="test_module" time="0.008" /><testcase name="[BOOST] Verify header file is present in BOOST_INC (gnu16/mpich)" classname="test_module" time="0.01" /><testcase name="[BOOST] Test interactive build/exec of f_test.cpp (gnu16/mpich)" classname="test_module" time="2.681" /></testsuite><testsuite name="test_module" time="2.93"><testcase name="[BOOST] Verify BOOST module is loaded and matches rpm version (gnu16/mvapich2)" classname="test_module" time="0.227" /><testcase name="[BOOST] Verify module BOOST_DIR is defined and exists (gnu16/mvapich2)" classname="test_module" time="0.009" /><testcase name="[BOOST] Verify module BOOST_LIB is defined and exists (gnu16/mvapich2)" classname="test_module" time="0.008" /><testcase name="[BOOST] Verify dynamic library available in BOOST_LIB (gnu16/mvapich2)" classname="test_module" time="0.007" /><testcase name="[BOOST] Verify static library is not present in BOOST_LIB (gnu16/mvapich2)" classname="test_module" time="0.009" /><testcase name="[BOOST] Verify module BOOST_INC is defined and exists (gnu16/mvapich2)" classname="test_module" time="0.008" /><testcase name="[BOOST] Verify header file is present in BOOST_INC (gnu16/mvapich2)" classname="test_module" time="0.007" /><testcase name="[BOOST] Test interactive build/exec of f_test.cpp (gnu16/mvapich2)" classname="test_module" time="2.655" /></testsuite><testsuite name="test_module" time="2.973"><testcase name="[BOOST] Verify BOOST module is loaded and matches rpm version (gnu16/openmpi5)" classname="test_module" time="0.234" /><testcase name="[BOOST] Verify module BOOST_DIR is defined and exists (gnu16/openmpi5)" classname="test_module" time="0.011" /><testcase name="[BOOST] Verify module BOOST_LIB is defined and exists (gnu16/openmpi5)" classname="test_module" time="0.009" /><testcase name="[BOOST] Verify dynamic library available in BOOST_LIB (gnu16/openmpi5)" classname="test_module" time="0.008" /><testcase name="[BOOST] Verify static library is not present in BOOST_LIB (gnu16/openmpi5)" classname="test_module" time="0.01" /><testcase name="[BOOST] Verify module BOOST_INC is defined and exists (gnu16/openmpi5)" classname="test_module" time="0.009" /><testcase name="[BOOST] Verify header file is present in BOOST_INC (gnu16/openmpi5)" classname="test_module" time="0.009" /><testcase name="[BOOST] Test interactive build/exec of f_test.cpp (gnu16/openmpi5)" classname="test_module" time="2.683" /></testsuite><testsuite name="test_module" time="0.277"><testcase name="[BOOST] Verify BOOST module is loaded and matches rpm version (gnu16/mpich)" classname="test_module" time="0.227" /><testcase name="[BOOST] Verify module BOOST_DIR is defined and exists (gnu16/mpich)" classname="test_module" time="0.009" /><testcase name="[BOOST] Verify module BOOST_LIB is defined and exists (gnu16/mpich)" classname="test_module" time="0.009" /><testcase name="[BOOST] Verify dynamic library available in BOOST_LIB (gnu16/mpich)" classname="test_module" time="0.008" /><testcase name="[BOOST] Verify static library is not present in BOOST_LIB (gnu16/mpich)" classname="test_module" time="0.008" /><testcase name="[BOOST] Verify module BOOST_INC is defined and exists (gnu16/mpich)" classname="test_module" time="0.008" /><testcase name="[BOOST] Verify header file is present in BOOST_INC (gnu16/mpich)" classname="test_module" time="0.008" /></testsuite><testsuite name="test_module" time="0.278"><testcase name="[BOOST] Verify BOOST module is loaded and matches rpm version (gnu16/mvapich2)" classname="test_module" time="0.225" /><testcase name="[BOOST] Verify module BOOST_DIR is defined and exists (gnu16/mvapich2)" classname="test_module" time="0.009" /><testcase name="[BOOST] Verify module BOOST_LIB is defined and exists (gnu16/mvapich2)" classname="test_module" time="0.01" /><testcase name="[BOOST] Verify dynamic library available in BOOST_LIB (gnu16/mvapich2)" classname="test_module" time="0.008" /><testcase name="[BOOST] Verify static library is not present in BOOST_LIB (gnu16/mvapich2)" classname="test_module" time="0.009" /><testcase name="[BOOST] Verify module BOOST_INC is defined and exists (gnu16/mvapich2)" classname="test_module" time="0.008" /><testcase name="[BOOST] Verify header file is present in BOOST_INC (gnu16/mvapich2)" classname="test_module" time="0.009" /></testsuite><testsuite name="rm_execution" time="0.0"><testcase name="" classname="rm_execution" time="0.0"><failure message="">(from function `ERROR' in file ./common/functions, line 11,
 from function `check_rms' in file ./common/functions, line 35,
 from function `setup_file' in test file rm_execution, line 14)
  `check_rms' failed with status 0
[OHPC-TEST:ERROR]: Unsupported or unknown resource manager</failure></testcase></testsuite><testsuite name="rm_execution" time="0.0"><testcase name="" classname="rm_execution" time="0.0"><failure message="">(from function `ERROR' in file ./common/functions, line 11,
 from function `check_rms' in file ./common/functions, line 35,
 from function `setup_file' in test file rm_execution, line 14)
  `check_rms' failed with status 0
[OHPC-TEST:ERROR]: Unsupported or unknown resource manager</failure></testcase></testsuite><testsuite name="test_module" time="0.247"><testcase name="[FFTW] Verify FFTW module is loaded and matches rpm version (gnu16/mpich)" classname="test_module" time="0.19" /><testcase name="[FFTW] Verify module FFTW_DIR is defined and exists (gnu16/mpich)" classname="test_module" time="0.012" /><testcase name="[FFTW] Verify module FFTW_LIB is defined and exists (gnu16/mpich)" classname="test_module" time="0.01" /><testcase name="[FFTW] Verify dynamic library available in FFTW_LIB (gnu16/mpich)" classname="test_module" time="0.01" /><testcase name="[FFTW] Verify static library is not present in FFTW_LIB (gnu16/mpich)" classname="test_module" time="0.009" /><testcase name="[FFTW] Verify module FFTW_INC is defined and exists (gnu16/mpich)" classname="test_module" time="0.008" /><testcase name="[FFTW] Verify header file is present in FFTW_INC (gnu16/mpich)" classname="test_module" time="0.008" /></testsuite><testsuite name="test_module" time="0.248"><testcase name="[FFTW] Verify FFTW module is loaded and matches rpm version (gnu16/mvapich2)" classname="test_module" time="0.192" /><testcase name="[FFTW] Verify module FFTW_DIR is defined and exists (gnu16/mvapich2)" classname="test_module" time="0.011" /><testcase name="[FFTW] Verify module FFTW_LIB is defined and exists (gnu16/mvapich2)" classname="test_module" time="0.009" /><testcase name="[FFTW] Verify dynamic library available in FFTW_LIB (gnu16/mvapich2)" classname="test_module" time="0.008" /><testcase name="[FFTW] Verify static library is not present in FFTW_LIB (gnu16/mvapich2)" classname="test_module" time="0.01" /><testcase name="[FFTW] Verify module FFTW_INC is defined and exists (gnu16/mvapich2)" classname="test_module" time="0.009" /><testcase name="[FFTW] Verify header file is present in FFTW_INC (gnu16/mvapich2)" classname="test_module" time="0.009" /></testsuite><testsuite name="rm_execution" time="0.0"><testcase name="" classname="rm_execution" time="0.0"><failure message="">(from function `ERROR' in file ../../../common/functions, line 11,
 from function `check_rms' in file ../../../common/functions, line 35,
 from function `setup_file' in test file rm_execution, line 17)
  `check_rms' failed with status 0
[OHPC-TEST:ERROR]: Unsupported or unknown resource manager</failure></testcase></testsuite><testsuite name="rm_execution" time="0.0"><testcase name="" classname="rm_execution" time="0.0"><failure message="">(from function `ERROR' in file ../../../common/functions, line 11,
 from function `check_rms' in file ../../../common/functions, line 35,
 from function `setup_file' in test file rm_execution, line 17)
  `check_rms' failed with status 0
[OHPC-TEST:ERROR]: Unsupported or unknown resource manager</failure></testcase></testsuite><testsuite name="test_module" time="0.237"><testcase name="[libs/GSL] Verify GSL module is loaded and matches rpm version (gnu16)" classname="test_module" time="0.181" /><testcase name="[libs/GSL] Verify module GSL_DIR is defined and exists (gnu16)" classname="test_module" time="0.011" /><testcase name="[libs/GSL] Verify module GSL_LIB is defined and exists (gnu16)" classname="test_module" time="0.009" /><testcase name="[libs/GSL] Verify dynamic library available in GSL_LIB (gnu16)" classname="test_module" time="0.009" /><testcase name="[libs/GSL] Verify static library is not present in GSL_LIB (gnu16)" classname="test_module" time="0.009" /><testcase name="[libs/GSL] Verify module GSL_INC is defined and exists (gnu16)" classname="test_module" time="0.009" /><testcase name="[libs/GSL] Verify header file is present in GSL_INC (gnu16)" classname="test_module" time="0.009" /></testsuite><testsuite name="rm_execution" time="0.0"><testcase name="" classname="rm_execution" time="0.0"><failure message="">(from function `ERROR' in file ../../../common/functions, line 11,
 from function `check_rms' in file ../../../common/functions, line 35,
 from function `setup_file' in test file rm_execution, line 18)
  `check_rms' failed with status 0
[OHPC-TEST:ERROR]: Unsupported or unknown resource manager</failure></testcase></testsuite><testsuite name="test_module" time="0.346"><testcase name="[libs/HYPRE] Verify HYPRE module is loaded and matches rpm version (gnu16/mvapich2)" classname="test_module" time="0.229" /><testcase name="[libs/HYPRE] Verify HYPRE_DIR is defined and directory exists (gnu16/mvapich2)" classname="test_module" time="0.018" /><testcase name="[libs/HYPRE] Verify module HYPRE_LIB is defined and exists (gnu16/mvapich2)" classname="test_module" time="0.02" /><testcase name="[libs/HYPRE] Verify dynamic library available in HYPRE_LIB (gnu16/mvapich2)" classname="test_module" time="0.019" /><testcase name="[libs/HYPRE] Verify static library is not present in HYPRE_LIB (gnu16/mvapich2)" classname="test_module" time="0.02" /><testcase name="[libs/HYPRE] Verify module HYPRE_INC is defined and exists (gnu16/mvapich2)" classname="test_module" time="0.021" /><testcase name="[libs/HYPRE] Verify header file is present in HYPRE_INC (gnu16/mvapich2)" classname="test_module" time="0.019" /></testsuite><testsuite name="rm_execution" time="0.0"><testcase name="" classname="rm_execution" time="0.0"><failure message="">(from function `ERROR' in file ../../../common/functions, line 11,
 from function `check_rms' in file ../../../common/functions, line 35,
 from function `setup_file' in test file rm_execution, line 18)
  `check_rms' failed with status 0
[OHPC-TEST:ERROR]: Unsupported or unknown resource manager</failure></testcase></testsuite><testsuite name="test_module" time="0.342"><testcase name="[libs/HYPRE] Verify HYPRE module is loaded and matches rpm version (gnu16/mpich)" classname="test_module" time="0.219" /><testcase name="[libs/HYPRE] Verify HYPRE_DIR is defined and directory exists (gnu16/mpich)" classname="test_module" time="0.021" /><testcase name="[libs/HYPRE] Verify module HYPRE_LIB is defined and exists (gnu16/mpich)" classname="test_module" time="0.02" /><testcase name="[libs/HYPRE] Verify dynamic library available in HYPRE_LIB (gnu16/mpich)" classname="test_module" time="0.021" /><testcase name="[libs/HYPRE] Verify static library is not present in HYPRE_LIB (gnu16/mpich)" classname="test_module" time="0.02" /><testcase name="[libs/HYPRE] Verify module HYPRE_INC is defined and exists (gnu16/mpich)" classname="test_module" time="0.021" /><testcase name="[libs/HYPRE] Verify header file is present in HYPRE_INC (gnu16/mpich)" classname="test_module" time="0.02" /></testsuite><testsuite name="test_module" time="0.279"><testcase name="[libs/Metis] Verify METIS module is loaded and matches rpm version (gnu16)" classname="test_module" time="0.19" /><testcase name="[libs/Metis] Verify module METIS_DIR is defined and exists (gnu16)" classname="test_module" time="0.01" /><testcase name="[libs/Metis] Verify module METIS_BIN is defined and exists (gnu16)" classname="test_module" time="0.01" /><testcase name="[libs/Metis] Verify availability of m2gmetis binary (gnu16)" classname="test_module" time="0.028" /><testcase name="[libs/Metis] Verify module METIS_LIB is defined and exists (gnu16)" classname="test_module" time="0.009" /><testcase name="[libs/Metis] Verify dynamic library available in METIS_LIB (gnu16)" classname="test_module" time="0.008" /><testcase name="[libs/Metis] Verify static library is not present in METIS_LIB (gnu16)" classname="test_module" time="0.008" /><testcase name="[libs/Metis] Verify module METIS_INC is defined and exists (gnu16)" classname="test_module" time="0.007" /><testcase name="[libs/Metis] Verify header file is present in METIS_INC (gnu16)" classname="test_module" time="0.009" /></testsuite><testsuite name="test_module" time="0.22"><testcase name="[libs/MUMPS] Verify MUMPS module is loaded and matches rpm version (gnu16-mpich)" classname="test_module" time="0.21" /><testcase name="[libs/MUMPS] Verify MUMPS_DIR is defined and directory exists (gnu16-mpich)" classname="test_module" time="0.01" /></testsuite><testsuite name="test_module" time="0.214"><testcase name="[libs/MUMPS] Verify MUMPS module is loaded and matches rpm version (gnu16-mvapich2)" classname="test_module" time="0.204" /><testcase name="[libs/MUMPS] Verify MUMPS_DIR is defined and directory exists (gnu16-mvapich2)" classname="test_module" time="0.01" /></testsuite><testsuite name="test_C_module" time="0.408"><testcase name="[libs/NetCDF] Verify NETCDF module is loaded and matches rpm version (gnu16/mpich)" classname="test_C_module" time="0.217" /><testcase name="[libs/NetCDF] Verify module NETCDF_DIR is defined and exists (gnu16/mpich)" classname="test_C_module" time="0.023" /><testcase name="[libs/NetCDF] Verify module NETCDF_BIN is defined and exists (gnu16/mpich)" classname="test_C_module" time="0.021" /><testcase name="[libs/NetCDF] Verify availability of nc-config binary (gnu16/mpich)" classname="test_C_module" time="0.047" /><testcase name="[libs/NetCDF] Verify module NETCDF_LIB is defined and exists (gnu16/mpich)" classname="test_C_module" time="0.021" /><testcase name="[libs/NetCDF] Verify dynamic library available in NETCDF_LIB (gnu16/mpich)" classname="test_C_module" time="0.019" /><testcase name="[libs/NetCDF] Verify static library is not present in NETCDF_LIB (gnu16/mpich)" classname="test_C_module" time="0.02" /><testcase name="[libs/NetCDF] Verify module NETCDF_INC is defined and exists (gnu16/mpich)" classname="test_C_module" time="0.021" /><testcase name="[libs/NetCDF] Verify header file is present in NETCDF_INC (gnu16/mpich)" classname="test_C_module" time="0.019" /></testsuite><testsuite name="test_CXX_module" time="0.425"><testcase name="[libs/NetCDF-CXX] Verify NETCDF_CXX module is loaded and matches rpm version (gnu16/mpich)" classname="test_CXX_module" time="0.235" /><testcase name="[libs/NetCDF-CXX] Verify module NETCDF_CXX_DIR is defined and exists (gnu16/mpich)" classname="test_CXX_module" time="0.021" /><testcase name="[libs/NetCDF-CXX] Verify module NETCDF_CXX_BIN is defined and exists (gnu16/mpich)" classname="test_CXX_module" time="0.022" /><testcase name="[libs/NetCDF-CXX] Verify availability of ncxx4-config binary (gnu16/mpich)" classname="test_CXX_module" time="0.046" /><testcase name="[libs/NetCDF-CXX] Verify module NETCDF_CXX_LIB is defined and exists (gnu16/mpich)" classname="test_CXX_module" time="0.02" /><testcase name="[libs/NetCDF-CXX] Verify dynamic library available in NETCDF_CXX_LIB (gnu16/mpich)" classname="test_CXX_module" time="0.02" /><testcase name="[libs/NetCDF-CXX] Verify static library is not present in NETCDF_CXX_LIB (gnu16/mpich)" classname="test_CXX_module" time="0.02" /><testcase name="[libs/NetCDF-CXX] Verify module NETCDF_CXX_INC is defined and exists (gnu16/mpich)" classname="test_CXX_module" time="0.021" /><testcase name="[libs/NetCDF-CXX] Verify header file is present in NETCDF_CXX_INC (gnu16/mpich)" classname="test_CXX_module" time="0.02" /></testsuite><testsuite name="test_Fortran_module" time="0.413"><testcase name="[libs/NetCDF-Fortran] Verify NETCDF_FORTRAN module is loaded and matches rpm version (gnu16/mpich)" classname="test_Fortran_module" time="0.222" /><testcase name="[libs/NetCDF-Fortran] Verify module NETCDF_FORTRAN_DIR is defined and exists (gnu16/mpich)" classname="test_Fortran_module" time="0.02" /><testcase name="[libs/NetCDF-Fortran] Verify module NETCDF_FORTRAN_BIN is defined and exists (gnu16/mpich)" classname="test_Fortran_module" time="0.021" /><testcase name="[libs/NetCDF-Fortran] Verify availability of nf-config binary (gnu16/mpich)" classname="test_Fortran_module" time="0.047" /><testcase name="[libs/NetCDF-Fortran] Verify module NETCDF_FORTRAN_LIB is defined and exists (gnu16/mpich)" classname="test_Fortran_module" time="0.021" /><testcase name="[libs/NetCDF-Fortran] Verify dynamic library available in NETCDF_FORTRAN_LIB (gnu16/mpich)" classname="test_Fortran_module" time="0.02" /><testcase name="[libs/NetCDF-Fortran] Verify static library is not present in NETCDF_FORTRAN_LIB (gnu16/mpich)" classname="test_Fortran_module" time="0.021" /><testcase name="[libs/NetCDF-Fortran] Verify module NETCDF_FORTRAN_INC is defined and exists (gnu16/mpich)" classname="test_Fortran_module" time="0.021" /><testcase name="[libs/NetCDF-Fortran] Verify header file is present in NETCDF_FORTRAN_INC (gnu16/mpich)" classname="test_Fortran_module" time="0.02" /></testsuite><testsuite name="test_netcdf" time="0.0"><testcase name="" classname="test_netcdf" time="0.0"><failure message="">(from function `ERROR' in file ./common/functions, line 11,
 from function `check_rms' in file ./common/functions, line 35,
 from function `setup_file' in test file test_netcdf, line 11)
  `check_rms' failed with status 0
[OHPC-TEST:ERROR]: Unsupported or unknown resource manager</failure></testcase></testsuite><testsuite name="test_C_module" time="0.399"><testcase name="[libs/NetCDF] Verify NETCDF module is loaded and matches rpm version (gnu16/mvapich2)" classname="test_C_module" time="0.212" /><testcase name="[libs/NetCDF] Verify module NETCDF_DIR is defined and exists (gnu16/mvapich2)" classname="test_C_module" time="0.021" /><testcase name="[libs/NetCDF] Verify module NETCDF_BIN is defined and exists (gnu16/mvapich2)" classname="test_C_module" time="0.018" /><testcase name="[libs/NetCDF] Verify availability of nc-config binary (gnu16/mvapich2)" classname="test_C_module" time="0.048" /><testcase name="[libs/NetCDF] Verify module NETCDF_LIB is defined and exists (gnu16/mvapich2)" classname="test_C_module" time="0.02" /><testcase name="[libs/NetCDF] Verify dynamic library available in NETCDF_LIB (gnu16/mvapich2)" classname="test_C_module" time="0.02" /><testcase name="[libs/NetCDF] Verify static library is not present in NETCDF_LIB (gnu16/mvapich2)" classname="test_C_module" time="0.02" /><testcase name="[libs/NetCDF] Verify module NETCDF_INC is defined and exists (gnu16/mvapich2)" classname="test_C_module" time="0.02" /><testcase name="[libs/NetCDF] Verify header file is present in NETCDF_INC (gnu16/mvapich2)" classname="test_C_module" time="0.02" /></testsuite><testsuite name="test_CXX_module" time="0.42"><testcase name="[libs/NetCDF-CXX] Verify NETCDF_CXX module is loaded and matches rpm version (gnu16/mvapich2)" classname="test_CXX_module" time="0.229" /><testcase name="[libs/NetCDF-CXX] Verify module NETCDF_CXX_DIR is defined and exists (gnu16/mvapich2)" classname="test_CXX_module" time="0.019" /><testcase name="[libs/NetCDF-CXX] Verify module NETCDF_CXX_BIN is defined and exists (gnu16/mvapich2)" classname="test_CXX_module" time="0.021" /><testcase name="[libs/NetCDF-CXX] Verify availability of ncxx4-config binary (gnu16/mvapich2)" classname="test_CXX_module" time="0.049" /><testcase name="[libs/NetCDF-CXX] Verify module NETCDF_CXX_LIB is defined and exists (gnu16/mvapich2)" classname="test_CXX_module" time="0.021" /><testcase name="[libs/NetCDF-CXX] Verify dynamic library available in NETCDF_CXX_LIB (gnu16/mvapich2)" classname="test_CXX_module" time="0.02" /><testcase name="[libs/NetCDF-CXX] Verify static library is not present in NETCDF_CXX_LIB (gnu16/mvapich2)" classname="test_CXX_module" time="0.02" /><testcase name="[libs/NetCDF-CXX] Verify module NETCDF_CXX_INC is defined and exists (gnu16/mvapich2)" classname="test_CXX_module" time="0.02" /><testcase name="[libs/NetCDF-CXX] Verify header file is present in NETCDF_CXX_INC (gnu16/mvapich2)" classname="test_CXX_module" time="0.021" /></testsuite><testsuite name="test_Fortran_module" time="0.417"><testcase name="[libs/NetCDF-Fortran] Verify NETCDF_FORTRAN module is loaded and matches rpm version (gnu16/mvapich2)" classname="test_Fortran_module" time="0.229" /><testcase name="[libs/NetCDF-Fortran] Verify module NETCDF_FORTRAN_DIR is defined and exists (gnu16/mvapich2)" classname="test_Fortran_module" time="0.021" /><testcase name="[libs/NetCDF-Fortran] Verify module NETCDF_FORTRAN_BIN is defined and exists (gnu16/mvapich2)" classname="test_Fortran_module" time="0.018" /><testcase name="[libs/NetCDF-Fortran] Verify availability of nf-config binary (gnu16/mvapich2)" classname="test_Fortran_module" time="0.046" /><testcase name="[libs/NetCDF-Fortran] Verify module NETCDF_FORTRAN_LIB is defined and exists (gnu16/mvapich2)" classname="test_Fortran_module" time="0.02" /><testcase name="[libs/NetCDF-Fortran] Verify dynamic library available in NETCDF_FORTRAN_LIB (gnu16/mvapich2)" classname="test_Fortran_module" time="0.02" /><testcase name="[libs/NetCDF-Fortran] Verify static library is not present in NETCDF_FORTRAN_LIB (gnu16/mvapich2)" classname="test_Fortran_module" time="0.021" /><testcase name="[libs/NetCDF-Fortran] Verify module NETCDF_FORTRAN_INC is defined and exists (gnu16/mvapich2)" classname="test_Fortran_module" time="0.021" /><testcase name="[libs/NetCDF-Fortran] Verify header file is present in NETCDF_FORTRAN_INC (gnu16/mvapich2)" classname="test_Fortran_module" time="0.021" /></testsuite><testsuite name="test_netcdf" time="0.0"><testcase name="" classname="test_netcdf" time="0.0"><failure message="">(from function `ERROR' in file ./common/functions, line 11,
 from function `check_rms' in file ./common/functions, line 35,
 from function `setup_file' in test file test_netcdf, line 11)
  `check_rms' failed with status 0
[OHPC-TEST:ERROR]: Unsupported or unknown resource manager</failure></testcase></testsuite><testsuite name="test_pnetcdf" time="0.0"><testcase name="" classname="test_pnetcdf" time="0.0"><failure message="">(from function `ERROR' in file ./common/functions, line 11,
 from function `check_rms' in file ./common/functions, line 35,
 from function `setup_file' in test file test_pnetcdf, line 12)
  `check_rms' failed with status 0
[OHPC-TEST:ERROR]: Unsupported or unknown resource manager</failure></testcase></testsuite><testsuite name="test_pnetcdf" time="0.0"><testcase name="" classname="test_pnetcdf" time="0.0"><failure message="">(from function `ERROR' in file ./common/functions, line 11,
 from function `check_rms' in file ./common/functions, line 35,
 from function `setup_file' in test file test_pnetcdf, line 12)
  `check_rms' failed with status 0
[OHPC-TEST:ERROR]: Unsupported or unknown resource manager</failure></testcase></testsuite><testsuite name="rm_execution" time="0.0"><testcase name="" classname="rm_execution" time="0.0"><failure message="">(from function `ERROR' in file ../../../common/functions, line 11,
 from function `check_rms' in file ../../../common/functions, line 35,
 from function `setup_file' in test file rm_execution, line 12)
  `check_rms' failed with status 0
[OHPC-TEST:ERROR]: Unsupported or unknown resource manager</failure></testcase></testsuite><testsuite name="test_lapack" time="0.339"><testcase name="[libs/OpenBLAS/eigen] run lapack eigen-value solver (gnu16)" classname="test_lapack" time="0.339" /></testsuite><testsuite name="test_module" time="0.28"><testcase name="[libs/OpenBLAS] Verify OPENBLAS module is loaded and matches rpm version (gnu16)" classname="test_module" time="0.202" /><testcase name="[libs/OpenBLAS] Verify OPENBLAS_DIR is defined and directory exists (gnu16)" classname="test_module" time="0.021" /><testcase name="[libs/OpenBLAS] Verify module OPENBLAS_LIB is defined and exists (gnu16)" classname="test_module" time="0.019" /><testcase name="[libs/OpenBLAS] Verify dynamic library available in OPENBLAS_LIB (gnu16)" classname="test_module" time="0.019" /><testcase name="[libs/OpenBLAS] Verify static library is not present in OPENBLAS_LIB (gnu16)" classname="test_module" time="0.019" /></testsuite><testsuite name="rm_execution" time="0.0"><testcase name="" classname="rm_execution" time="0.0"><failure message="">(from function `ERROR' in file ../../../common/functions, line 11,
 from function `check_rms' in file ../../../common/functions, line 35,
 from function `setup_file' in test file rm_execution, line 17)
  `check_rms' failed with status 0
[OHPC-TEST:ERROR]: Unsupported or unknown resource manager</failure></testcase></testsuite><testsuite name="test_module" time="0.0"><testcase name="" classname="test_module" time="0.0"><failure message="">(from function `ERROR' in file ../../../common/functions, line 11,
 from function `check_rms' in file ../../../common/functions, line 35,
 from function `setup_file' in test file test_module, line 18)
  `check_rms' failed with status 0
[OHPC-TEST:ERROR]: Unsupported or unknown resource manager</failure></testcase></testsuite><testsuite name="rm_execution" time="0.0"><testcase name="" classname="rm_execution" time="0.0"><failure message="">(from function `ERROR' in file ../../../common/functions, line 11,
 from function `check_rms' in file ../../../common/functions, line 35,
 from function `setup_file' in test file rm_execution, line 17)
  `check_rms' failed with status 0
[OHPC-TEST:ERROR]: Unsupported or unknown resource manager</failure></testcase></testsuite><testsuite name="test_module" time="0.0"><testcase name="" classname="test_module" time="0.0"><failure message="">(from function `ERROR' in file ../../../common/functions, line 11,
 from function `check_rms' in file ../../../common/functions, line 35,
 from function `setup_file' in test file test_module, line 18)
  `check_rms' failed with status 0
[OHPC-TEST:ERROR]: Unsupported or unknown resource manager</failure></testcase></testsuite><testsuite name="rm_execution" time="0.0"><testcase name="" classname="rm_execution" time="0.0"><failure message="">(from function `teardown_file' in test file rm_execution, line 32)
  `teardown_file() {' failed with status 0
[OHPC-TEST:ERROR]: Unsupported or unknown resource manager</failure></testcase></testsuite><testsuite name="test_module" time="0.334"><testcase name="[libs/PHDF5] Verify HDF5 module is loaded and matches rpm version (gnu16-mpich)" classname="test_module" time="0.215" /><testcase name="[libs/PHDF5] Verify HDF5_DIR is defined and directory exists (gnu16-mpich)" classname="test_module" time="0.019" /><testcase name="[libs/PHDF5] Verify module HDF5_LIB is defined and exists (gnu16-mpich)" classname="test_module" time="0.021" /><testcase name="[libs/PHDF5] Verify dynamic library available in HDF5_LIB (gnu16-mpich)" classname="test_module" time="0.018" /><testcase name="[libs/PHDF5] Verify static library is not present in HDF5_LIB (gnu16-mpich)" classname="test_module" time="0.021" /><testcase name="[libs/PHDF5] Verify module HDF5_INC is defined and exists (gnu16-mpich)" classname="test_module" time="0.02" /><testcase name="[libs/PHDF5] Verify header file is present in HDF5_INC (gnu16-mpich)" classname="test_module" time="0.02" /></testsuite><testsuite name="rm_execution" time="0.0"><testcase name="" classname="rm_execution" time="0.0"><failure message="">(from function `teardown_file' in test file rm_execution, line 32)
  `teardown_file() {' failed with status 0
[OHPC-TEST:ERROR]: Unsupported or unknown resource manager</failure></testcase></testsuite><testsuite name="test_module" time="0.331"><testcase name="[libs/PHDF5] Verify HDF5 module is loaded and matches rpm version (gnu16-mvapich2)" classname="test_module" time="0.21" /><testcase name="[libs/PHDF5] Verify HDF5_DIR is defined and directory exists (gnu16-mvapich2)" classname="test_module" time="0.021" /><testcase name="[libs/PHDF5] Verify module HDF5_LIB is defined and exists (gnu16-mvapich2)" classname="test_module" time="0.021" /><testcase name="[libs/PHDF5] Verify dynamic library available in HDF5_LIB (gnu16-mvapich2)" classname="test_module" time="0.021" /><testcase name="[libs/PHDF5] Verify static library is not present in HDF5_LIB (gnu16-mvapich2)" classname="test_module" time="0.019" /><testcase name="[libs/PHDF5] Verify module HDF5_INC is defined and exists (gnu16-mvapich2)" classname="test_module" time="0.02" /><testcase name="[libs/PHDF5] Verify header file is present in HDF5_INC (gnu16-mvapich2)" classname="test_module" time="0.019" /></testsuite><testsuite name="rm_execution" time="0.0"><testcase name="" classname="rm_execution" time="0.0"><failure message="">(from function `ERROR' in file ../../../common/functions, line 11,
 from function `check_rms' in file ../../../common/functions, line 35,
 from function `setup_file' in test file rm_execution, line 12)
  `check_rms' failed with status 0
[OHPC-TEST:ERROR]: Unsupported or unknown resource manager</failure></testcase></testsuite><testsuite name="test_module" time="0.34"><testcase name="[libs/PLASMA] Verify PLASMA module is loaded and matches rpm version (gnu16)" classname="test_module" time="0.222" /><testcase name="[libs/PLASMA] Verify PLASMA_DIR is defined and directory exists (gnu16)" classname="test_module" time="0.021" /><testcase name="[libs/PLASMA] Verify module PLASMA_LIB is defined and exists (gnu16)" classname="test_module" time="0.02" /><testcase name="[libs/PLASMA] Verify dynamic library available in PLASMA_LIB (gnu16)" classname="test_module" time="0.019" /><testcase name="[libs/PLASMA] Verify static library is not present in PLASMA_LIB (gnu16)" classname="test_module" time="0.02" /><testcase name="[libs/PLASMA] Verify module PLASMA_INC is defined and exists (gnu16)" classname="test_module" time="0.019" /><testcase name="[libs/PLASMA] Verify header file is present in PLASMA_INC (gnu16)" classname="test_module" time="0.019" /></testsuite><testsuite name="test_module" time="0.238"><testcase name="[PNETCDF] Verify PNETCDF module is loaded and matches rpm version (gnu16)" classname="test_module" time="0.2" /><testcase name="[PNETCDF] Verify module PNETCDF_DIR is defined and exists (gnu16)" classname="test_module" time="0.011" /><testcase name="[PNETCDF] Verify module PNETCDF_LIB is defined and exists (gnu16)" classname="test_module" time="0.008" /><testcase name="[PNETCDF] Verify module PNETCDF_INC is defined and exists (gnu16)" classname="test_module" time="0.01" /><testcase name="[PNETCDF] Verify header file is present in PNETCDF_INC (gnu16)" classname="test_module" time="0.009" /></testsuite><testsuite name="rm_execution" time="0.0"><testcase name="" classname="rm_execution" time="0.0"><failure message="">(from function `ERROR' in file ../../../common/functions, line 11,
 from function `check_rms' in file ../../../common/functions, line 35,
 from function `setup_file' in test file rm_execution, line 12)
  `check_rms' failed with status 0
[OHPC-TEST:ERROR]: Unsupported or unknown resource manager</failure></testcase></testsuite><testsuite name="test_module" time="0.383"><testcase name="[libs/PTScotch] Verify PTSCOTCH module is loaded and matches rpm version (gnu16-mpich)" classname="test_module" time="0.217" /><testcase name="[libs/PTScotch] Verify PTSCOTCH_DIR is defined and directory exists (gnu16-mpich)" classname="test_module" time="0.021" /><testcase name="[libs/PTScotch] Verify module PTSCOTCH_LIB is defined and exists (gnu16-mpich)" classname="test_module" time="0.02" /><testcase name="[libs/PTScotch] Verify dynamic library available in PTSCOTCH_LIB (gnu16-mpich)" classname="test_module" time="0.02" /><testcase name="[libs/PTScotch] Verify static library is not present in PTSCOTCH_LIB (gnu16-mpich)" classname="test_module" time="0.019" /><testcase name="[libs/PTScotch] Verify module PTSCOTCH_INC is defined and exists (gnu16-mpich)" classname="test_module" time="0.018" /><testcase name="[libs/PTScotch] Verify header file is present in PTSCOTCH_INC (gnu16-mpich)" classname="test_module" time="0.02" /><testcase name="[libs/PTScotch] Verify module PTSCOTCH_BIN is defined and exists (gnu16-mpich)" classname="test_module" time="0.019" /><testcase name="[libs/PTScotch] Verify availability of dgscat binary (gnu16-mpich)" classname="test_module" time="0.029" /></testsuite><testsuite name="rm_execution" time="0.0"><testcase name="" classname="rm_execution" time="0.0"><failure message="">(from function `ERROR' in file ../../../common/functions, line 11,
 from function `check_rms' in file ../../../common/functions, line 35,
 from function `setup_file' in test file rm_execution, line 12)
  `check_rms' failed with status 0
[OHPC-TEST:ERROR]: Unsupported or unknown resource manager</failure></testcase></testsuite><testsuite name="test_module" time="0.389"><testcase name="[libs/PTScotch] Verify PTSCOTCH module is loaded and matches rpm version (gnu16-mvapich2)" classname="test_module" time="0.215" /><testcase name="[libs/PTScotch] Verify PTSCOTCH_DIR is defined and directory exists (gnu16-mvapich2)" classname="test_module" time="0.02" /><testcase name="[libs/PTScotch] Verify module PTSCOTCH_LIB is defined and exists (gnu16-mvapich2)" classname="test_module" time="0.022" /><testcase name="[libs/PTScotch] Verify dynamic library available in PTSCOTCH_LIB (gnu16-mvapich2)" classname="test_module" time="0.02" /><testcase name="[libs/PTScotch] Verify static library is not present in PTSCOTCH_LIB (gnu16-mvapich2)" classname="test_module" time="0.021" /><testcase name="[libs/PTScotch] Verify module PTSCOTCH_INC is defined and exists (gnu16-mvapich2)" classname="test_module" time="0.02" /><testcase name="[libs/PTScotch] Verify header file is present in PTSCOTCH_INC (gnu16-mvapich2)" classname="test_module" time="0.02" /><testcase name="[libs/PTScotch] Verify module PTSCOTCH_BIN is defined and exists (gnu16-mvapich2)" classname="test_module" time="0.019" /><testcase name="[libs/PTScotch] Verify availability of dgscat binary (gnu16-mvapich2)" classname="test_module" time="0.032" /></testsuite><testsuite name="rm_execution" time="0.0"><testcase name="" classname="rm_execution" time="0.0"><failure message="">(from function `ERROR' in file ./common/functions, line 11,
 from function `check_rms' in file ./common/functions, line 35,
 from function `setup_file' in test file rm_execution, line 12)
  `check_rms' failed with status 0
[OHPC-TEST:ERROR]: Unsupported or unknown resource manager</failure></testcase></testsuite><testsuite name="test_module" time="0.0"><testcase name="" classname="test_module" time="0.0"><failure message="">(from function `ERROR' in file ./common/functions, line 11,
 from function `check_rms' in file ./common/functions, line 35,
 from function `setup_file' in test file test_module, line 18)
  `check_rms' failed with status 0
[OHPC-TEST:ERROR]: Unsupported or unknown resource manager</failure></testcase></testsuite><testsuite name="rm_execution" time="0.0"><testcase name="" classname="rm_execution" time="0.0"><failure message="">(from function `ERROR' in file ./common/functions, line 11,
 from function `check_rms' in file ./common/functions, line 35,
 from function `setup_file' in test file rm_execution, line 12)
  `check_rms' failed with status 0
[OHPC-TEST:ERROR]: Unsupported or unknown resource manager</failure></testcase></testsuite><testsuite name="test_module" time="0.0"><testcase name="" classname="test_module" time="0.0"><failure message="">(from function `ERROR' in file ./common/functions, line 11,
 from function `check_rms' in file ./common/functions, line 35,
 from function `setup_file' in test file test_module, line 18)
  `check_rms' failed with status 0
[OHPC-TEST:ERROR]: Unsupported or unknown resource manager</failure></testcase></testsuite><testsuite name="rm_execution" time="0.0"><testcase name="" classname="rm_execution" time="0.0"><failure message="">(from function `ERROR' in file ../../../common/functions, line 11,
 from function `check_rms' in file ../../../common/functions, line 35,
 from function `setup_file' in test file rm_execution, line 12)
  `check_rms' failed with status 0
[OHPC-TEST:ERROR]: Unsupported or unknown resource manager</failure></testcase></testsuite><testsuite name="test_module" time="0.366"><testcase name="[libs/Scotch] Verify SCOTCH module is loaded and matches rpm version (gnu16)" classname="test_module" time="0.202" /><testcase name="[libs/Scotch] Verify SCOTCH_DIR is defined and directory exists (gnu16)" classname="test_module" time="0.02" /><testcase name="[libs/Scotch] Verify module SCOTCH_LIB is defined and exists (gnu16)" classname="test_module" time="0.02" /><testcase name="[libs/Scotch] Verify dynamic library available in SCOTCH_LIB (gnu16)" classname="test_module" time="0.02" /><testcase name="[libs/Scotch] Verify static library is not present in SCOTCH_LIB (gnu16)" classname="test_module" time="0.019" /><testcase name="[libs/Scotch] Verify module SCOTCH_INC is defined and exists (gnu16)" classname="test_module" time="0.018" /><testcase name="[libs/Scotch] Verify header file is present in SCOTCH_INC (gnu16)" classname="test_module" time="0.019" /><testcase name="[libs/Scotch] Verify module SCOTCH_BIN is defined and exists (gnu16)" classname="test_module" time="0.018" /><testcase name="[libs/Scotch] Verify availability of gout binary (gnu16)" classname="test_module" time="0.03" /></testsuite><testsuite name="rm_execution" time="0.0"><testcase name="" classname="rm_execution" time="0.0"><failure message="">(from function `ERROR' in file ../../../common/functions, line 11,
 from function `check_rms' in file ../../../common/functions, line 35,
 from function `setup_file' in test file rm_execution, line 12)
  `check_rms' failed with status 0
[OHPC-TEST:ERROR]: Unsupported or unknown resource manager</failure></testcase></testsuite><testsuite name="test_module" time="0.339"><testcase name="[libs/SuperLU] Verify SUPERLU module is loaded and matches rpm version (gnu16)" classname="test_module" time="0.218" /><testcase name="[libs/SuperLU] Verify SUPERLU_DIR is defined and directory exists (gnu16)" classname="test_module" time="0.021" /><testcase name="[libs/SuperLU] Verify module SUPERLU_LIB is defined and exists (gnu16)" classname="test_module" time="0.02" /><testcase name="[libs/SuperLU] Verify dynamic library available in SUPERLU_LIB (gnu16)" classname="test_module" time="0.02" /><testcase name="[libs/SuperLU] Verify static library is not present in SUPERLU_LIB (gnu16)" classname="test_module" time="0.021" /><testcase name="[libs/SuperLU] Verify module SUPERLU_INC is defined and exists (gnu16)" classname="test_module" time="0.021" /><testcase name="[libs/SuperLU] Verify header file is present in SUPERLU_INC (gnu16)" classname="test_module" time="0.018" /></testsuite><testsuite name="rm_execution" time="0.0"><testcase name="" classname="rm_execution" time="0.0"><failure message="">(from function `ERROR' in file ../../../common/functions, line 11,
 from function `check_rms' in file ../../../common/functions, line 35,
 from function `setup_file' in test file rm_execution, line 19)
  `check_rms' failed with status 0
[OHPC-TEST:ERROR]: Unsupported or unknown resource manager</failure></testcase></testsuite><testsuite name="test_module" time="0.363"><testcase name="[libs/SuperLU_DIST] Verify SUPERLU_DIST module is loaded and matches rpm version (gnu16/mvapich2)" classname="test_module" time="0.241" /><testcase name="[libs/SuperLU_DIST] Verify SUPERLU_DIST_DIR is defined and directory exists (gnu16/mvapich2)" classname="test_module" time="0.021" /><testcase name="[libs/SuperLU_DIST] Verify module SUPERLU_DIST_LIB is defined and exists (gnu16/mvapich2)" classname="test_module" time="0.018" /><testcase name="[libs/SuperLU_DIST] Verify dynamic library available in SUPERLU_DIST_LIB (gnu16/mvapich2)" classname="test_module" time="0.021" /><testcase name="[libs/SuperLU_DIST] Verify static library is not present in SUPERLU_DIST_LIB (gnu16/mvapich2)" classname="test_module" time="0.021" /><testcase name="[libs/SuperLU_DIST] Verify module SUPERLU_DIST_INC is defined and exists (gnu16/mvapich2)" classname="test_module" time="0.021" /><testcase name="[libs/SuperLU_DIST] Verify header file is present in SUPERLU_DIST_INC (gnu16/mvapich2)" classname="test_module" time="0.02" /></testsuite><testsuite name="rm_execution" time="0.0"><testcase name="" classname="rm_execution" time="0.0"><failure message="">(from function `ERROR' in file ../../../common/functions, line 11,
 from function `check_rms' in file ../../../common/functions, line 35,
 from function `setup_file' in test file rm_execution, line 19)
  `check_rms' failed with status 0
[OHPC-TEST:ERROR]: Unsupported or unknown resource manager</failure></testcase></testsuite><testsuite name="test_module" time="0.358"><testcase name="[libs/SuperLU_DIST] Verify SUPERLU_DIST module is loaded and matches rpm version (gnu16/mpich)" classname="test_module" time="0.236" /><testcase name="[libs/SuperLU_DIST] Verify SUPERLU_DIST_DIR is defined and directory exists (gnu16/mpich)" classname="test_module" time="0.018" /><testcase name="[libs/SuperLU_DIST] Verify module SUPERLU_DIST_LIB is defined and exists (gnu16/mpich)" classname="test_module" time="0.02" /><testcase name="[libs/SuperLU_DIST] Verify dynamic library available in SUPERLU_DIST_LIB (gnu16/mpich)" classname="test_module" time="0.021" /><testcase name="[libs/SuperLU_DIST] Verify static library is not present in SUPERLU_DIST_LIB (gnu16/mpich)" classname="test_module" time="0.021" /><testcase name="[libs/SuperLU_DIST] Verify module SUPERLU_DIST_INC is defined and exists (gnu16/mpich)" classname="test_module" time="0.021" /><testcase name="[libs/SuperLU_DIST] Verify header file is present in SUPERLU_DIST_INC (gnu16/mpich)" classname="test_module" time="0.021" /></testsuite><testsuite name="rm_execution" time="0.0"><testcase name="" classname="rm_execution" time="0.0"><failure message="">(from function `ERROR' in file ../../../common/functions, line 11,
 from function `check_rms' in file ../../../common/functions, line 35,
 from function `setup_file' in test file rm_execution, line 18)
  `check_rms' failed with status 0
[OHPC-TEST:ERROR]: Unsupported or unknown resource manager</failure></testcase></testsuite><testsuite name="rm_execution" time="0.0"><testcase name="" classname="rm_execution" time="0.0"><failure message="">(from function `ERROR' in file ../../../common/functions, line 11,
 from function `check_rms' in file ../../../common/functions, line 35,
 from function `setup_file' in test file rm_execution, line 18)
  `check_rms' failed with status 0
[OHPC-TEST:ERROR]: Unsupported or unknown resource manager</failure></testcase></testsuite><testsuite name="lmod_installed" time="0.04"><testcase name="[modules] Check if lmod RPM installed" classname="lmod_installed" time="0.04" /></testsuite><testsuite name="interactive_commands" time="5.147"><testcase name="[modules] module purge" classname="interactive_commands" time="0.169" /><testcase name="[modules] module list" classname="interactive_commands" time="0.286" /><testcase name="[modules] module help" classname="interactive_commands" time="0.332" /><testcase name="[modules] module load/unload" classname="interactive_commands" time="1.794" /><testcase name="[modules] module whatis" classname="interactive_commands" time="0.3" /><testcase name="[modules] module swap" classname="interactive_commands" time="0.691" /><testcase name="[modules] path updated" classname="interactive_commands" time="0.931" /><testcase name="[modules] module depends-on" classname="interactive_commands" time="0.644" /></testsuite><testsuite name="man_page_check" time="0.102"><testcase name="[MPI] mpicc man page available (gnu16/mpich)" classname="man_page_check" time="0.102" /></testsuite><testsuite name="rm_execution_multi_host" time="0.0"><testcase name="" classname="rm_execution_multi_host" time="0.0"><failure message="">(from function `ERROR' in file ../../common/functions, line 11,
 from function `check_rms' in file ../../common/functions, line 35,
 from function `setup_file' in test file rm_execution_multi_host, line 17)
  `check_rms' failed with status 0
[OHPC-TEST:ERROR]: Unsupported or unknown resource manager</failure></testcase></testsuite><testsuite name="rm_execution_single_host" time="0.0"><testcase name="" classname="rm_execution_single_host" time="0.0"><failure message="">(from function `ERROR' in file ../../common/functions, line 11,
 from function `check_rms' in file ../../common/functions, line 35,
 from function `setup_file' in test file rm_execution_single_host, line 17)
  `check_rms' failed with status 0
[OHPC-TEST:ERROR]: Unsupported or unknown resource manager</failure></testcase></testsuite><testsuite name="version_match" time="0.486"><testcase name="[MPI] MPI module loaded (gnu16/mpich)" classname="version_match" time="0.15" /><testcase name="[MPI] MPI module version available (gnu16/mpich)" classname="version_match" time="0.147" /><testcase name="[MPI] mpicc, mpicxx, and mpif90 versions match module (gnu16/mpich)" classname="version_match" time="0.189" /></testsuite><testsuite name="man_page_check" time="0.095"><testcase name="[MPI] mpicc man page available (gnu16/mvapich2)" classname="man_page_check" time="0.095" /></testsuite><testsuite name="rm_execution_multi_host" time="0.0"><testcase name="" classname="rm_execution_multi_host" time="0.0"><failure message="">(from function `ERROR' in file ../../common/functions, line 11,
 from function `check_rms' in file ../../common/functions, line 35,
 from function `setup_file' in test file rm_execution_multi_host, line 17)
  `check_rms' failed with status 0
[OHPC-TEST:ERROR]: Unsupported or unknown resource manager</failure></testcase></testsuite><testsuite name="rm_execution_single_host" time="0.0"><testcase name="" classname="rm_execution_single_host" time="0.0"><failure message="">(from function `ERROR' in file ../../common/functions, line 11,
 from function `check_rms' in file ../../common/functions, line 35,
 from function `setup_file' in test file rm_execution_single_host, line 17)
  `check_rms' failed with status 0
[OHPC-TEST:ERROR]: Unsupported or unknown resource manager</failure></testcase></testsuite><testsuite name="version_match" time="0.477"><testcase name="[MPI] MPI module loaded (gnu16/mvapich2)" classname="version_match" time="0.152" /><testcase name="[MPI] MPI module version available (gnu16/mvapich2)" classname="version_match" time="0.147" /><testcase name="[MPI] mpicc, mpicxx, and mpif90 versions match module (gnu16/mvapich2)" classname="version_match" time="0.178" /></testsuite><testsuite name="conman" time="0.127"><testcase name="[ConMan] Verify conman binary available" classname="conman" time="0.024" /><testcase name="[ConMan] Verify rpm version matches binary" classname="conman" time="0.058" /><testcase name="[ConMan] Verify man page availability" classname="conman" time="0.045" /></testsuite><testsuite name="warewulf-ipmi" time="0.0"><testcase name="[warewulf-ipmi] ipmitool lanplus protocol" classname="warewulf-ipmi" time="0.0"><skipped message="">Warewulf not installed, skipping warewulf-ipmitool check</skipped></testcase></testsuite><testsuite name="test_module" time="2.625"><testcase name="[perf-tools/Dimemas] Verify dimemas module is loaded and matches rpm version (gnu16/mpich)" classname="test_module" time="0.218" /><testcase name="[perf-tools/Dimemas] Verify DIMEMAS_DIR is defined and exists (gnu16/mpich)" classname="test_module" time="0.019" /><testcase name="[perf-tools/Dimemas] Verify DIMEMAS_BIN is defined and exists (gnu16/mpich)" classname="test_module" time="0.021" /><testcase name="[perf-tools/Dimemas] Verify availability of prv2dim binary (gnu16/mpich)" classname="test_module" time="0.028" /><testcase name="[perf-tools/Dimemas] Verify availability of Dimemas binary (gnu16/mpich)" classname="test_module" time="0.027" /><testcase name="[perf-tools/Dimemas] Run Dimemas simulation (gnu16/mpich)" classname="test_module" time="2.312" /></testsuite><testsuite name="test_module" time="2.607"><testcase name="[perf-tools/Dimemas] Verify dimemas module is loaded and matches rpm version (gnu16/mvapich2)" classname="test_module" time="0.218" /><testcase name="[perf-tools/Dimemas] Verify DIMEMAS_DIR is defined and exists (gnu16/mvapich2)" classname="test_module" time="0.021" /><testcase name="[perf-tools/Dimemas] Verify DIMEMAS_BIN is defined and exists (gnu16/mvapich2)" classname="test_module" time="0.019" /><testcase name="[perf-tools/Dimemas] Verify availability of prv2dim binary (gnu16/mvapich2)" classname="test_module" time="0.026" /><testcase name="[perf-tools/Dimemas] Verify availability of Dimemas binary (gnu16/mvapich2)" classname="test_module" time="0.027" /><testcase name="[perf-tools/Dimemas] Run Dimemas simulation (gnu16/mvapich2)" classname="test_module" time="2.296" /></testsuite><testsuite name="test_module" time="2.631"><testcase name="[perf-tools/Dimemas] Verify dimemas module is loaded and matches rpm version (gnu16/openmpi5)" classname="test_module" time="0.223" /><testcase name="[perf-tools/Dimemas] Verify DIMEMAS_DIR is defined and exists (gnu16/openmpi5)" classname="test_module" time="0.022" /><testcase name="[perf-tools/Dimemas] Verify DIMEMAS_BIN is defined and exists (gnu16/openmpi5)" classname="test_module" time="0.022" /><testcase name="[perf-tools/Dimemas] Verify availability of prv2dim binary (gnu16/openmpi5)" classname="test_module" time="0.026" /><testcase name="[perf-tools/Dimemas] Verify availability of Dimemas binary (gnu16/openmpi5)" classname="test_module" time="0.028" /><testcase name="[perf-tools/Dimemas] Run Dimemas simulation (gnu16/openmpi5)" classname="test_module" time="2.31" /></testsuite><testsuite name="test_module" time="0.223"><testcase name="[IMB] Verify IMB module is loaded and matches rpm version (gnu16-mpich)" classname="test_module" time="0.2" /><testcase name="[IMB] Verify IMB_DIR is defined and directory exists (gnu16-mpich)" classname="test_module" time="0.01" /><testcase name="[IMB] Verify executables are present in IMB_DIR/bin (gnu16-mpich)" classname="test_module" time="0.013" /></testsuite><testsuite name="test_module" time="0.219"><testcase name="[IMB] Verify IMB module is loaded and matches rpm version (gnu16-mvapich2)" classname="test_module" time="0.196" /><testcase name="[IMB] Verify IMB_DIR is defined and directory exists (gnu16-mvapich2)" classname="test_module" time="0.009" /><testcase name="[IMB] Verify executables are present in IMB_DIR/bin (gnu16-mvapich2)" classname="test_module" time="0.014" /></testsuite><testsuite name="rm_execution" time="0.0"><testcase name="" classname="rm_execution" time="0.0"><failure message="">(from function `ERROR' in file ./common/functions, line 11,
 from function `check_rms' in file ./common/functions, line 35,
 from function `setup_file' in test file rm_execution, line 15)
  `check_rms' failed with status 0
[OHPC-TEST:ERROR]: Unsupported or unknown resource manager</failure></testcase></testsuite><testsuite name="test_module" time="0.379"><testcase name="[OMB] Verify OMB module is loaded and matches rpm version (gnu16-mpich)" classname="test_module" time="0.205" /><testcase name="[OMB] Verify OMB_DIR is defined and directory exists (gnu16-mpich)" classname="test_module" time="0.021" /><testcase name="[OMB] Verify osu_bw binary is available (gnu16-mpich)" classname="test_module" time="0.03" /><testcase name="[OMB] Verify osu_latency binary is available (gnu16-mpich)" classname="test_module" time="0.031" /><testcase name="[OMB] Verify osu_allgather binary is available (gnu16-mpich)" classname="test_module" time="0.031" /><testcase name="[OMB] Verify osu_get_bw binary is available (gnu16-mpich)" classname="test_module" time="0.029" /><testcase name="[OMB] Verify osu_put_latency binary is available (gnu16-mpich)" classname="test_module" time="0.032" /></testsuite><testsuite name="rm_execution" time="0.0"><testcase name="" classname="rm_execution" time="0.0"><failure message="">(from function `ERROR' in file ./common/functions, line 11,
 from function `check_rms' in file ./common/functions, line 35,
 from function `setup_file' in test file rm_execution, line 15)
  `check_rms' failed with status 0
[OHPC-TEST:ERROR]: Unsupported or unknown resource manager</failure></testcase></testsuite><testsuite name="test_module" time="0.379"><testcase name="[OMB] Verify OMB module is loaded and matches rpm version (gnu16-mvapich2)" classname="test_module" time="0.21" /><testcase name="[OMB] Verify OMB_DIR is defined and directory exists (gnu16-mvapich2)" classname="test_module" time="0.019" /><testcase name="[OMB] Verify osu_bw binary is available (gnu16-mvapich2)" classname="test_module" time="0.03" /><testcase name="[OMB] Verify osu_latency binary is available (gnu16-mvapich2)" classname="test_module" time="0.029" /><testcase name="[OMB] Verify osu_allgather binary is available (gnu16-mvapich2)" classname="test_module" time="0.029" /><testcase name="[OMB] Verify osu_get_bw binary is available (gnu16-mvapich2)" classname="test_module" time="0.03" /><testcase name="[OMB] Verify osu_put_latency binary is available (gnu16-mvapich2)" classname="test_module" time="0.032" /></testsuite><testsuite name="rm_execution" time="0.0"><testcase name="" classname="rm_execution" time="0.0"><failure message="">(from function `ERROR' in file ./common/functions, line 11,
 from function `check_rms' in file ./common/functions, line 35,
 from function `setup_file' in test file rm_execution, line 15)
  `check_rms' failed with status 0
[OHPC-TEST:ERROR]: Unsupported or unknown resource manager</failure></testcase></testsuite><testsuite name="test_module" time="0.398"><testcase name="[OMB] Verify OMB module is loaded and matches rpm version (gnu16-openmpi5)" classname="test_module" time="0.226" /><testcase name="[OMB] Verify OMB_DIR is defined and directory exists (gnu16-openmpi5)" classname="test_module" time="0.018" /><testcase name="[OMB] Verify osu_bw binary is available (gnu16-openmpi5)" classname="test_module" time="0.031" /><testcase name="[OMB] Verify osu_latency binary is available (gnu16-openmpi5)" classname="test_module" time="0.032" /><testcase name="[OMB] Verify osu_allgather binary is available (gnu16-openmpi5)" classname="test_module" time="0.031" /><testcase name="[OMB] Verify osu_get_bw binary is available (gnu16-openmpi5)" classname="test_module" time="0.031" /><testcase name="[OMB] Verify osu_put_latency binary is available (gnu16-openmpi5)" classname="test_module" time="0.029" /></testsuite><testsuite name="rm_execution" time="0.0"><testcase name="" classname="rm_execution" time="0.0"><failure message="">(from function `ERROR' in file ../../../common/functions, line 11,
 from function `check_rms' in file ../../../common/functions, line 35,
 from function `setup_file' in test file rm_execution, line 17)
  `check_rms' failed with status 0
[OHPC-TEST:ERROR]: Unsupported or unknown resource manager</failure></testcase></testsuite><testsuite name="test_module" time="0.402"><testcase name="[perf-tools/Paraver] Verify paraver module is loaded and matches rpm version" classname="test_module" time="0.213" /><testcase name="[perf-tools/Paraver] Verify PARAVER_DIR is defined and exists" classname="test_module" time="0.021" /><testcase name="[perf-tools/Paraver] Verify PARAVER_BIN is defined and exists" classname="test_module" time="0.02" /><testcase name="[perf-tools/Paraver] Verify availability of paramedir binary" classname="test_module" time="0.026" /><testcase name="[perf-tools/Paraver] Verify availability of wxparaver binary" classname="test_module" time="0.028" /><testcase name="[perf-tools/Paraver] Verify availability of prvstats binary" classname="test_module" time="0.027" /><testcase name="[perf-tools/Paraver] Verify availability of prvmerger binary" classname="test_module" time="0.027" /><testcase name="[perf-tools/Paraver] Verify PARAVER_LIB is defined and exists" classname="test_module" time="0.02" /><testcase name="[perf-tools/Paraver] Verify PARAVER_INC is defined and exists" classname="test_module" time="0.02" /></testsuite><testsuite name="rm_execution" time="0.0"><testcase name="" classname="rm_execution" time="0.0"><failure message="">(from function `ERROR' in file ../../../common/functions, line 11,
 from function `check_rms' in file ../../../common/functions, line 35,
 from function `setup_file' in test file rm_execution, line 17)
  `check_rms' failed with status 0
[OHPC-TEST:ERROR]: Unsupported or unknown resource manager</failure></testcase></testsuite><testsuite name="test_module" time="0.412"><testcase name="[perf-tools/Paraver] Verify paraver module is loaded and matches rpm version" classname="test_module" time="0.222" /><testcase name="[perf-tools/Paraver] Verify PARAVER_DIR is defined and exists" classname="test_module" time="0.021" /><testcase name="[perf-tools/Paraver] Verify PARAVER_BIN is defined and exists" classname="test_module" time="0.021" /><testcase name="[perf-tools/Paraver] Verify availability of paramedir binary" classname="test_module" time="0.027" /><testcase name="[perf-tools/Paraver] Verify availability of wxparaver binary" classname="test_module" time="0.025" /><testcase name="[perf-tools/Paraver] Verify availability of prvstats binary" classname="test_module" time="0.027" /><testcase name="[perf-tools/Paraver] Verify availability of prvmerger binary" classname="test_module" time="0.027" /><testcase name="[perf-tools/Paraver] Verify PARAVER_LIB is defined and exists" classname="test_module" time="0.021" /><testcase name="[perf-tools/Paraver] Verify PARAVER_INC is defined and exists" classname="test_module" time="0.021" /></testsuite><testsuite name="test_module" time="0.373"><testcase name="[perf-tools/Scalasca] Verify scalasca module is loaded and matches rpm version (gnu16/mpich)" classname="test_module" time="0.217" /><testcase name="[perf-tools/Scalasca] Verify module SCALASCA_DIR is defined and exists (gnu16/mpich)" classname="test_module" time="0.009" /><testcase name="[perf-tools/Scalasca] Verify module SCALASCA_BIN is defined and exists (gnu16/mpich)" classname="test_module" time="0.009" /><testcase name="[perf-tools/Scalasca] Verify availability of scalasca binary (gnu16/mpich)" classname="test_module" time="0.017" /><testcase name="[perf-tools/Scalasca] Verify availability of scan binary (gnu16/mpich)" classname="test_module" time="0.016" /><testcase name="[perf-tools/Scalasca] Verify availability of scout.mpi binary (gnu16/mpich)" classname="test_module" time="0.016" /><testcase name="[perf-tools/Scalasca] Verify availability of scout.omp binary (gnu16/mpich)" classname="test_module" time="0.017" /><testcase name="[perf-tools/Scalasca] Verify availability of scout.hyb binary (gnu16/mpich)" classname="test_module" time="0.017" /><testcase name="[perf-tools/Scalasca] Verify availability of scout.ser binary (gnu16/mpich)" classname="test_module" time="0.018" /><testcase name="[perf-tools/Scalasca] Verify availability of square binary (gnu16/mpich)" classname="test_module" time="0.017" /><testcase name="[perf-tools/Scalasca] Verify availability of user guide for scalasca (gnu16/mpich)" classname="test_module" time="0.02" /></testsuite><testsuite name="test_module" time="0.374"><testcase name="[perf-tools/Scalasca] Verify scalasca module is loaded and matches rpm version (gnu16/mvapich2)" classname="test_module" time="0.219" /><testcase name="[perf-tools/Scalasca] Verify module SCALASCA_DIR is defined and exists (gnu16/mvapich2)" classname="test_module" time="0.009" /><testcase name="[perf-tools/Scalasca] Verify module SCALASCA_BIN is defined and exists (gnu16/mvapich2)" classname="test_module" time="0.008" /><testcase name="[perf-tools/Scalasca] Verify availability of scalasca binary (gnu16/mvapich2)" classname="test_module" time="0.016" /><testcase name="[perf-tools/Scalasca] Verify availability of scan binary (gnu16/mvapich2)" classname="test_module" time="0.017" /><testcase name="[perf-tools/Scalasca] Verify availability of scout.mpi binary (gnu16/mvapich2)" classname="test_module" time="0.017" /><testcase name="[perf-tools/Scalasca] Verify availability of scout.omp binary (gnu16/mvapich2)" classname="test_module" time="0.017" /><testcase name="[perf-tools/Scalasca] Verify availability of scout.hyb binary (gnu16/mvapich2)" classname="test_module" time="0.017" /><testcase name="[perf-tools/Scalasca] Verify availability of scout.ser binary (gnu16/mvapich2)" classname="test_module" time="0.018" /><testcase name="[perf-tools/Scalasca] Verify availability of square binary (gnu16/mvapich2)" classname="test_module" time="0.018" /><testcase name="[perf-tools/Scalasca] Verify availability of user guide for scalasca (gnu16/mvapich2)" classname="test_module" time="0.018" /></testsuite><testsuite name="test_module" time="0.391"><testcase name="[perf-tools/Scalasca] Verify scalasca module is loaded and matches rpm version (gnu16/openmpi5)" classname="test_module" time="0.228" /><testcase name="[perf-tools/Scalasca] Verify module SCALASCA_DIR is defined and exists (gnu16/openmpi5)" classname="test_module" time="0.01" /><testcase name="[perf-tools/Scalasca] Verify module SCALASCA_BIN is defined and exists (gnu16/openmpi5)" classname="test_module" time="0.008" /><testcase name="[perf-tools/Scalasca] Verify availability of scalasca binary (gnu16/openmpi5)" classname="test_module" time="0.017" /><testcase name="[perf-tools/Scalasca] Verify availability of scan binary (gnu16/openmpi5)" classname="test_module" time="0.017" /><testcase name="[perf-tools/Scalasca] Verify availability of scout.mpi binary (gnu16/openmpi5)" classname="test_module" time="0.017" /><testcase name="[perf-tools/Scalasca] Verify availability of scout.omp binary (gnu16/openmpi5)" classname="test_module" time="0.019" /><testcase name="[perf-tools/Scalasca] Verify availability of scout.hyb binary (gnu16/openmpi5)" classname="test_module" time="0.017" /><testcase name="[perf-tools/Scalasca] Verify availability of scout.ser binary (gnu16/openmpi5)" classname="test_module" time="0.018" /><testcase name="[perf-tools/Scalasca] Verify availability of square binary (gnu16/openmpi5)" classname="test_module" time="0.018" /><testcase name="[perf-tools/Scalasca] Verify availability of user guide for scalasca (gnu16/openmpi5)" classname="test_module" time="0.022" /></testsuite><testsuite name="instrumenter_test" time="0.0"><testcase name="" classname="instrumenter_test" time="0.0"><failure message="">(from function `ERROR' in file ./common/functions, line 11,
 from function `check_rms' in file ./common/functions, line 35,
 from function `setup_file' in test file instrumenter_test, line 14)
  `check_rms' failed with status 0
[OHPC-TEST:ERROR]: Unsupported or unknown resource manager</failure></testcase></testsuite><testsuite name="rm_execution" time="0.0"><testcase name="" classname="rm_execution" time="0.0"><failure message="">(from function `ERROR' in file ./common/functions, line 11,
 from function `check_rms' in file ./common/functions, line 35,
 from function `setup_file' in test file rm_execution, line 18)
  `check_rms' failed with status 0
[OHPC-TEST:ERROR]: Unsupported or unknown resource manager</failure></testcase></testsuite><testsuite name="test_module" time="0.725"><testcase name="[perf-tools/Score-P] Verify scorep module is loaded and matches rpm version (gnu16/mpich)" classname="test_module" time="0.227" /><testcase name="[perf-tools/Score-P] Verify module SCOREP_DIR is defined and exists (gnu16/mpich)" classname="test_module" time="0.023" /><testcase name="[perf-tools/Score-P] Verify module SCOREP_BIN is defined and exists (gnu16/mpich)" classname="test_module" time="0.021" /><testcase name="[perf-tools/Score-P] Verify availability of scorep binary (gnu16/mpich)" classname="test_module" time="0.031" /><testcase name="[perf-tools/Score-P] Verify availability of scorep-backend-info binary (gnu16/mpich)" classname="test_module" time="0.032" /><testcase name="[perf-tools/Score-P] Verify availability of scorep-config binary (gnu16/mpich)" classname="test_module" time="0.032" /><testcase name="[perf-tools/Score-P] Verify availability of scorep-info binary (gnu16/mpich)" classname="test_module" time="0.032" /><testcase name="[perf-tools/Score-P] Verify availability of scorep-preload-init binary (gnu16/mpich)" classname="test_module" time="0.032" /><testcase name="[perf-tools/Score-P] Verify availability of scorep-score binary (gnu16/mpich)" classname="test_module" time="0.032" /><testcase name="[perf-tools/Score-P] Verify availability of scorep-wrapper binary (gnu16/mpich)" classname="test_module" time="0.031" /><testcase name="[perf-tools/Score-P] Verify availability of scorep wrapper binaries (gnu16/mpich)" classname="test_module" time="0.13" /><testcase name="[perf-tools/Score-P] Verify availability of user guide for scorep (gnu16/mpich)" classname="test_module" time="0.034" /><testcase name="[perf-tools/Score-P] Verify availability of OPEN_ISSUES for scorep (gnu16/mpich)" classname="test_module" time="0.034" /><testcase name="[perf-tools/Score-P] Verify availability of README.LICENSES.md for scorep (gnu16/mpich)" classname="test_module" time="0.034" /></testsuite><testsuite name="instrumenter_test" time="0.0"><testcase name="" classname="instrumenter_test" time="0.0"><failure message="">(from function `ERROR' in file ./common/functions, line 11,
 from function `check_rms' in file ./common/functions, line 35,
 from function `setup_file' in test file instrumenter_test, line 14)
  `check_rms' failed with status 0
[OHPC-TEST:ERROR]: Unsupported or unknown resource manager</failure></testcase></testsuite><testsuite name="rm_execution" time="0.0"><testcase name="" classname="rm_execution" time="0.0"><failure message="">(from function `ERROR' in file ./common/functions, line 11,
 from function `check_rms' in file ./common/functions, line 35,
 from function `setup_file' in test file rm_execution, line 18)
  `check_rms' failed with status 0
[OHPC-TEST:ERROR]: Unsupported or unknown resource manager</failure></testcase></testsuite><testsuite name="test_module" time="0.719"><testcase name="[perf-tools/Score-P] Verify scorep module is loaded and matches rpm version (gnu16/mvapich2)" classname="test_module" time="0.229" /><testcase name="[perf-tools/Score-P] Verify module SCOREP_DIR is defined and exists (gnu16/mvapich2)" classname="test_module" time="0.021" /><testcase name="[perf-tools/Score-P] Verify module SCOREP_BIN is defined and exists (gnu16/mvapich2)" classname="test_module" time="0.021" /><testcase name="[perf-tools/Score-P] Verify availability of scorep binary (gnu16/mvapich2)" classname="test_module" time="0.033" /><testcase name="[perf-tools/Score-P] Verify availability of scorep-backend-info binary (gnu16/mvapich2)" classname="test_module" time="0.032" /><testcase name="[perf-tools/Score-P] Verify availability of scorep-config binary (gnu16/mvapich2)" classname="test_module" time="0.031" /><testcase name="[perf-tools/Score-P] Verify availability of scorep-info binary (gnu16/mvapich2)" classname="test_module" time="0.031" /><testcase name="[perf-tools/Score-P] Verify availability of scorep-preload-init binary (gnu16/mvapich2)" classname="test_module" time="0.031" /><testcase name="[perf-tools/Score-P] Verify availability of scorep-score binary (gnu16/mvapich2)" classname="test_module" time="0.03" /><testcase name="[perf-tools/Score-P] Verify availability of scorep-wrapper binary (gnu16/mvapich2)" classname="test_module" time="0.031" /><testcase name="[perf-tools/Score-P] Verify availability of scorep wrapper binaries (gnu16/mvapich2)" classname="test_module" time="0.131" /><testcase name="[perf-tools/Score-P] Verify availability of user guide for scorep (gnu16/mvapich2)" classname="test_module" time="0.033" /><testcase name="[perf-tools/Score-P] Verify availability of OPEN_ISSUES for scorep (gnu16/mvapich2)" classname="test_module" time="0.032" /><testcase name="[perf-tools/Score-P] Verify availability of README.LICENSES.md for scorep (gnu16/mvapich2)" classname="test_module" time="0.033" /></testsuite><testsuite name="instrumenter_test" time="0.0"><testcase name="" classname="instrumenter_test" time="0.0"><failure message="">(from function `ERROR' in file ./common/functions, line 11,
 from function `check_rms' in file ./common/functions, line 35,
 from function `setup_file' in test file instrumenter_test, line 14)
  `check_rms' failed with status 0
[OHPC-TEST:ERROR]: Unsupported or unknown resource manager</failure></testcase></testsuite><testsuite name="rm_execution" time="0.0"><testcase name="" classname="rm_execution" time="0.0"><failure message="">(from function `ERROR' in file ./common/functions, line 11,
 from function `check_rms' in file ./common/functions, line 35,
 from function `setup_file' in test file rm_execution, line 18)
  `check_rms' failed with status 0
[OHPC-TEST:ERROR]: Unsupported or unknown resource manager</failure></testcase></testsuite><testsuite name="test_module" time="0.758"><testcase name="[perf-tools/Score-P] Verify scorep module is loaded and matches rpm version (gnu16/openmpi5)" classname="test_module" time="0.228" /><testcase name="[perf-tools/Score-P] Verify module SCOREP_DIR is defined and exists (gnu16/openmpi5)" classname="test_module" time="0.022" /><testcase name="[perf-tools/Score-P] Verify module SCOREP_BIN is defined and exists (gnu16/openmpi5)" classname="test_module" time="0.019" /><testcase name="[perf-tools/Score-P] Verify availability of scorep binary (gnu16/openmpi5)" classname="test_module" time="0.032" /><testcase name="[perf-tools/Score-P] Verify availability of scorep-backend-info binary (gnu16/openmpi5)" classname="test_module" time="0.032" /><testcase name="[perf-tools/Score-P] Verify availability of scorep-config binary (gnu16/openmpi5)" classname="test_module" time="0.032" /><testcase name="[perf-tools/Score-P] Verify availability of scorep-info binary (gnu16/openmpi5)" classname="test_module" time="0.031" /><testcase name="[perf-tools/Score-P] Verify availability of scorep-preload-init binary (gnu16/openmpi5)" classname="test_module" time="0.031" /><testcase name="[perf-tools/Score-P] Verify availability of scorep-score binary (gnu16/openmpi5)" classname="test_module" time="0.032" /><testcase name="[perf-tools/Score-P] Verify availability of scorep-wrapper binary (gnu16/openmpi5)" classname="test_module" time="0.032" /><testcase name="[perf-tools/Score-P] Verify availability of scorep wrapper binaries (gnu16/openmpi5)" classname="test_module" time="0.168" /><testcase name="[perf-tools/Score-P] Verify availability of user guide for scorep (gnu16/openmpi5)" classname="test_module" time="0.034" /><testcase name="[perf-tools/Score-P] Verify availability of OPEN_ISSUES for scorep (gnu16/openmpi5)" classname="test_module" time="0.032" /><testcase name="[perf-tools/Score-P] Verify availability of README.LICENSES.md for scorep (gnu16/openmpi5)" classname="test_module" time="0.033" /></testsuite><testsuite name="test_harness" time="0.0"><testcase name="" classname="test_harness" time="0.0"><failure message="">(from function `ERROR' in file ../../common/functions, line 11,
 from function `check_rms' in file ../../common/functions, line 35,
 from function `setup_file' in test file test_harness, line 12)
  `check_rms' failed with status 0
[OHPC-TEST:ERROR]: Unsupported or unknown resource manager</failure></testcase></testsuite><testsuite name="test_harness" time="0.0"><testcase name="" classname="test_harness" time="0.0"><failure message="">(from function `ERROR' in file ../../common/functions, line 11,
 from function `check_rms' in file ../../common/functions, line 35,
 from function `setup_file' in test file test_harness, line 12)
  `check_rms' failed with status 0
[OHPC-TEST:ERROR]: Unsupported or unknown resource manager</failure></testcase></testsuite><testsuite name="completion" time="0.078"><testcase name="[singularity] check for bash completion" classname="completion" time="0.078" /></testsuite><testsuite name="mem_limits" time="0.037"><testcase name="[memlock] check increased soft limit" classname="mem_limits" time="0.018"><failure message="">(from function `ERROR' in file ../common/functions, line 11,
 from function `check_rms' in file ../common/functions, line 35,
 from function `setup' in test file mem_limits, line 18)
  `check_rms' failed
[OHPC-TEST:ERROR]: Unsupported or unknown resource manager</failure></testcase><testcase name="[memlock] check increased hard limit" classname="mem_limits" time="0.019"><failure message="">(from function `ERROR' in file ../common/functions, line 11,
 from function `check_rms' in file ../common/functions, line 35,
 from function `setup' in test file mem_limits, line 18)
  `check_rms' failed
[OHPC-TEST:ERROR]: Unsupported or unknown resource manager</failure></testcase></testsuite><testsuite name="pdsh" time="0.0"><testcase name="" classname="pdsh" time="0.0"><failure message="">(from function `ERROR' in file ../common/functions, line 11,
 from function `check_rms' in file ../common/functions, line 35,
 from function `setup_file' in test file pdsh, line 12)
  `check_rms' failed with status 0
[OHPC-TEST:ERROR]: Unsupported or unknown resource manager</failure></testcase></testsuite><testsuite name="ompi_info" time="0.493"><testcase name="[openmpi] check for no output to stderr with ompi_info" classname="ompi_info" time="0.493"><failure message="">(in test file ompi_info, line 33)
  `ompi_info &gt;/dev/null 2&gt;"${OUTPUT}"' failed with status 127</failure></testcase></testsuite><testsuite name="magpie" time="0.0"><testcase name="" classname="magpie" time="0.0"><failure message="">(from function `ERROR' in file ../common/functions, line 11,
 from function `check_rms' in file ../common/functions, line 35,
 from function `setup_file' in test file magpie, line 12)
  `check_rms' failed with status 0
[OHPC-TEST:ERROR]: Unsupported or unknown resource manager</failure></testcase></testsuite><testsuite name="munge" time="1.104"><testcase name="[munge] check for OS provdied RPM" classname="munge" time="0.046" /><testcase name="[munge] Generate a credential" classname="munge" time="0.019" /><testcase name="[munge] Decode credential locally" classname="munge" time="0.017" /><testcase name="[munge] Run benchmark" classname="munge" time="1.022" /></testsuite><testsuite name="sacct" time="0.0"><testcase name="[slurm] check for working sacct" classname="sacct" time="0.0"><skipped message="">Temporarily skip sacct check</skipped></testcase></testsuite></testsuites>